{"text_format":"1","workbook":"xlsx","n_sheets":20,"sheets":["Week 1","Week 2","Week 3","Week 4","Week 5","Week 6","Week 7","Week 8","Week 9","Week 10","Week 11","Week 12","Week 13","Week 14","Week 15","Week 16","Week 17","cumulative_points","dev_notes","Schedule"],"not_rendered":{"charts":0,"images":0,"macros":1,"external_links":0,"defined_names":38,"comments":0,"pivot_tables":0},"unopened":[],"bounds":{"document_bytes":16777216,"sheet_cells":100000,"rows_first":2000,"rows_last":500,"rows_between":2000,"halvings":0,"cell_chars":16384,"cell_head_chars":4096},"cells_cut":0,"cells_raw":0,"read":"whole","date_system":"1900"}

{"sheet":"Week 1","index":0,"n_rows":110,"n_cols":41,"rows_kept":110,"cut":false,"hidden":false,"merged":[[9,17,9,18],[1,17,1,18],[4,23,9,23],[1,19,3,23]]}
["Week Lookup Column Offset",2,3,4,5,6,7,8,9,10,11,12,13,14,15,16,17]
[null,"GAME 1","GAME 2","GAME 3","GAME 4","GAME 5","GAME 6","GAME 7","GAME 8","GAME 9","GAME 10","GAME 11","GAME 12","GAME 13","GAME 14","GAME 15","GAME 16","SCORE",null,"Week 1"]
["VISITOR",{"$f":"IF(VLOOKUP($T$2&\" Visitors\",SCHEDULE_TABLE,B$1,FALSE)=0,\"\",VLOOKUP($T$2&\" Visitors\",SCHEDULE_TABLE,B$1,FALSE))","v":"GB"},"NO","CIN","BUF","WAS","TEN","NE","OAK","JAX","CLE","MIN","SF","CAR","IND","NYG","SD",null,"pts"]
[null,"at","at","at","at","at","at","at","at","at","at","at","at","at","at","at","at"]
["HOME",{"$f":"IF(VLOOKUP($T$2&\" Homes\",SCHEDULE_TABLE,B$1,FALSE)=0,\"\",VLOOKUP($T$2&\" Homes\",SCHEDULE_TABLE,B$1,FALSE))","v":"SEA"},"ATL","BAL","CHI","HOU","KC","MIA","NYJ","PHI","PIT","STL","DAL","TB","DEN","DET","ARI",null,"pts",null,null,null,null,"TOTAL POINTS FOR YEAR"]
["WINNER",null,null,null,null,null,null,null,null,null,null,null,null,null,null,null,null,{"$f":"IF(R3+R5=0,\"\",R3+R5)","v":""},"pts"]
[null,{"$f":"B3","v":"GB"},"NO","CIN","BUF","WAS","TEN","NE","OAK","JAX","CLE","MIN","SF","CAR","IND","NYG","SD"]
[null,{"$f":"B5","v":"SEA"},"ATL","BAL","CHI","HOU","KC","MIA","NYJ","PHI","PIT","STL","DAL","TB","DEN","DET","ARI"]
[]
["NAME","PICKS","PICKS","PICKS","PICKS","PICKS","PICKS","PICKS","PICKS","PICKS","PICKS","PICKS","PICKS","PICKS","PICKS","PICKS","PICKS","TIE-BREAK",null,"PICK PTS","PTS RANK","ABS DIFF","TIE-BREAK"]
["<Enter Participant 1>",null,null,null,null,null,null,null,null,null,null,null,null,null,null,null,null,null,"pts",{"$f":"IF(SUM(Z11:AO11)=0,0,SUM(Z11:AO11))","v":0},{"$f":"IF(ISERROR(RANK(T11,$T$11:$T$85)),\"\",RANK(T11,$T$11:$T$85))","v":1},{"$f":"IF(ISBLANK(R11),\"\",IF(U11=1,ABS(R11-R$6),\"\"))","v":""},{"$f":"IF(ISERROR(RANK(V11,$V$11:$V$85,1)),\"\",RANK(V11,$V$11:$V$85,1))","v":""},{"$f":"IF(T11=\"\",0,T11)","v":0},null,{"$f":"IF(ISBLANK(B$6),\"\",IF(B11=B$6,1,0))","v":""},{"$f":"IF(ISBLANK(C$6),\"\",IF(C11=C$6,1,0))","v":""},{"$f":"IF(ISBLANK(D$6),\"\",IF(D11=D$6,1,0))","v":""},{"$f":"IF(ISBLANK(E$6),\"\",IF(E11=E$6,1,0))","v":""},{"$f":"IF(ISBLANK(F$6),\"\",IF(F11=F$6,1,0))","v":""},{"$f":"IF(ISBLANK(G$6),\"\",IF(G11=G$6,1,0))","v":""},{"$f":"IF(ISBLANK(H$6),\"\",IF(H11=H$6,1,0))","v":""},{"$f":"IF(ISBLANK(I$6),\"\",IF(I11=I$6,1,0))","v":""},{"$f":"IF(ISBLANK(J$6),\"\",IF(J11=J$6,1,0))","v":""},{"$f":"IF(ISBLANK(K$6),\"\",IF(K11=K$6,1,0))","v":""},{"$f":"IF(ISBLANK(L$6),\"\",IF(L11=L$6,1,0))","v":""},{"$f":"IF(ISBLANK(M$6),\"\",IF(M11=M$6,1,0))","v":""},{"$f":"IF(ISBLANK(N$6),\"\",IF(N11=N$6,1,0))","v":""},{"$f":"IF(ISBLANK(O$6),\"\",IF(O11=O$6,1,0))","v":""},{"$f":"IF(ISBLANK(P$6),\"\",IF(P11=P$6,1,0))","v":""},{"$f":"IF(ISBLANK(Q$6),\"\",IF(Q11=Q$6,1,0))","v":""}]
["<Enter Participant 2>",null,null,null,null,null,null,null,null,null,null,null,null,null,null,null,null,null,"pts",0,1,"","",0,null,"","","","","","","","","","","","","","","",""]
["<Enter Participant 3>",null,null,null,null,null,null,null,null,null,null,null,null,null,null,null,null,null,"pts",0,1,"","",0,null,"","","","","","","","","","","","","","","",""]
["<Enter Participant 4>",null,null,null,null,null,null,null,null,null,null,null,null,null,null,null,null,null,"pts",0,1,"","",0,null,"","","","","","","","","","","","","","","",""]
["<Enter Participant 5>",null,null,null,null,null,null,null,null,null,null,null,null,null,null,null,null,null,"pts",0,1,"","",0,null,"","","","","","","","","","","","","","","",""]
["<Enter Participant 6>",null,null,null,null,null,null,null,null,null,null,null,null,null,null,null,null,null,"pts",0,1,"","",0,null,"","","","","","","","","","","","","","","",""]
["<Enter Participant 7>",null,null,null,null,null,null,null,null,null,null,null,null,null,null,null,null,null,"pts",0,1,"","",0,null,"","","","","","","","","","","","","","","",""]
["<Enter Participant 8>",null,null,null,null,null,null,null,null,null,null,null,null,null,null,null,null,null,"pts",0,1,"","",0,null,"","","","","","","","","","","","","","","",""]
["<Enter Participant 9>",null,null,null,null,null,null,null,null,null,null,null,null,null,null,null,null,null,"pts",0,1,"","",0,null,"","","","","","","","","","","","","","","",""]
["<Enter Participant 10>",null,null,null,null,null,null,null,null,null,null,null,null,null,null,null,null,null,"pts",0,1,"","",0,null,"","","","","","","","","","","","","","","",""]
["<Enter Participant 11>",null,null,null,null,null,null,null,null,null,null,null,null,null,null,null,null,null,"pts",0,1,"","",0,null,"","","","","","","","","","","","","","","",""]
["<Enter Participant 12>",null,null,null,null,null,null,null,null,null,null,null,null,null,null,null,null,null,"pts",0,1,"","",0,null,"","","","","","","","","","","","","","","",""]
["<Enter Participant 13>",null,null,null,null,null,null,null,null,null,null,null,null,null,null,null,null,null,"pts",0,1,"","",0,null,"","","","","","","","","","","","","","","",""]
["<Enter Participant 14>",null,null,null,null,null,null,null,null,null,null,null,null,null,null,null,null,null,"pts",0,1,"","",0,null,"","","","","","","","","","","","","","","",""]
["<Enter Participant 15>",null,null,null,null,null,null,null,null,null,null,null,null,null,null,null,null,null,"pts",0,1,"","",0,null,"","","","","","","","","","","","","","","",""]
["<Enter Participant 16>",null,null,null,null,null,null,null,null,null,null,null,null,null,null,null,null,null,"pts",0,1,"","",0,null,"","","","","","","","","","","","","","","",""]
["<Enter Participant 17>",null,null,null,null,null,null,null,null,null,null,null,null,null,null,null,null,null,"pts",0,1,"","",0,null,"","","","","","","","","","","","","","","",""]
["<Enter Participant 18>",null,null,null,null,null,null,null,null,null,null,null,null,null,null,null,null,null,"pts",0,1,"","",0,null,"","","","","","","","","","","","","","","",""]
["<Enter Participant 19>",null,null,null,null,null,null,null,null,null,null,null,null,null,null,null,null,null,"pts",0,1,"","",0,null,"","","","","","","","","","","","","","","",""]
["<Enter Participant 20>",null,null,null,null,null,null,null,null,null,null,null,null,null,null,null,null,null,"pts",0,1,"","",0,null,"","","","","","","","","","","","","","","",""]
["<Enter Participant 21>",null,null,null,null,null,null,null,null,null,null,null,null,null,null,null,null,null,"pts",0,1,"","",0,null,"","","","","","","","","","","","","","","",""]
["<Enter Participant 22>",null,null,null,null,null,null,null,null,null,null,null,null,null,null,null,null,null,"pts",0,1,"","",0,null,"","","","","","","","","","","","","","","",""]
["<Enter Participant 23>",null,null,null,null,null,null,null,null,null,null,null,null,null,null,null,null,null,"pts",0,1,"","",0,null,"","","","","","","","","","","","","","","",""]
["<Enter Participant 24>",null,null,null,null,null,null,null,null,null,null,null,null,null,null,null,null,null,"pts",0,1,"","",0,null,"","","","","","","","","","","","","","","",""]
["<Enter Participant 25>",null,null,null,null,null,null,null,null,null,null,null,null,null,null,null,null,null,"pts",0,1,"","",0,null,"","","","","","","","","","","","","","","",""]
["<Enter Participant 26>",null,null,null,null,null,null,null,null,null,null,null,null,null,null,null,null,null,"pts",0,1,"","",0,null,"","","","","","","","","","","","","","","",""]
["<Enter Participant 27>",null,null,null,null,null,null,null,null,null,null,null,null,null,null,null,null,null,"pts",0,1,"","",0,null,"","","","","","","","","","","","","","","",""]
["<Enter Participant 28>",null,null,null,null,null,null,null,null,null,null,null,null,null,null,null,null,null,"pts",0,1,"","",0,null,"","","","","","","","","","","","","","","",""]
["<Enter Participant 29>",null,null,null,null,null,null,null,null,null,null,null,null,null,null,null,null,null,"pts",0,1,"","",0,null,"","","","","","","","","","","","","","","",""]
["<Enter Participant 30>",null,null,null,null,null,null,null,null,null,null,null,null,null,null,null,null,null,"pts",0,1,"","",0,null,"","","","","","","","","","","","","","","",""]
["<Enter Participant 31>",null,null,null,null,null,null,null,null,null,null,null,null,null,null,null,null,null,"pts",0,1,"","",0,null,"","","","","","","","","","","","","","","",""]
["<Enter Participant 32>",null,null,null,null,null,null,null,null,null,null,null,null,null,null,null,null,null,"pts",0,1,"","",0,null,"","","","","","","","","","","","","","","",""]
["<Enter Participant 33>",null,null,null,null,null,null,null,null,null,null,null,null,null,null,null,null,null,"pts",{"$f":"IF(SUM(Z43:AO43)=0,0,SUM(Z43:AO43))","v":0},{"$f":"IF(ISERROR(RANK(T43,$T$11:$T$85)),\"\",RANK(T43,$T$11:$T$85))","v":1},{"$f":"IF(ISBLANK(R43),\"\",IF(U43=1,ABS(R43-R$6),\"\"))","v":""},{"$f":"IF(ISERROR(RANK(V43,$V$11:$V$85,1)),\"\",RANK(V43,$V$11:$V$85,1))","v":""},{"$f":"IF(T43=\"\",0,T43)","v":0},null,{"$f":"IF(ISBLANK(B$6),\"\",IF(B43=B$6,1,0))","v":""},{"$f":"IF(ISBLANK(C$6),\"\",IF(C43=C$6,1,0))","v":""},{"$f":"IF(ISBLANK(D$6),\"\",IF(D43=D$6,1,0))","v":""},{"$f":"IF(ISBLANK(E$6),\"\",IF(E43=E$6,1,0))","v":""},{"$f":"IF(ISBLANK(F$6),\"\",IF(F43=F$6,1,0))","v":""},{"$f":"IF(ISBLANK(G$6),\"\",IF(G43=G$6,1,0))","v":""},{"$f":"IF(ISBLANK(H$6),\"\",IF(H43=H$6,1,0))","v":""},{"$f":"IF(ISBLANK(I$6),\"\",IF(I43=I$6,1,0))","v":""},{"$f":"IF(ISBLANK(J$6),\"\",IF(J43=J$6,1,0))","v":""},{"$f":"IF(ISBLANK(K$6),\"\",IF(K43=K$6,1,0))","v":""},{"$f":"IF(ISBLANK(L$6),\"\",IF(L43=L$6,1,0))","v":""},{"$f":"IF(ISBLANK(M$6),\"\",IF(M43=M$6,1,0))","v":""},{"$f":"IF(ISBLANK(N$6),\"\",IF(N43=N$6,1,0))","v":""},{"$f":"IF(ISBLANK(O$6),\"\",IF(O43=O$6,1,0))","v":""},{"$f":"IF(ISBLANK(P$6),\"\",IF(P43=P$6,1,0))","v":""},{"$f":"IF(ISBLANK(Q$6),\"\",IF(Q43=Q$6,1,0))","v":""}]
["<Enter Participant 34>",null,null,null,null,null,null,null,null,null,null,null,null,null,null,null,null,null,"pts",0,1,"","",0,null,"","","","","","","","","","","","","","","",""]
["<Enter Participant 35>",null,null,null,null,null,null,null,null,null,null,null,null,null,null,null,null,null,"pts",0,1,"","",0,null,"","","","","","","","","","","","","","","",""]
["<Enter Participant 36>",null,null,null,null,null,null,null,null,null,null,null,null,null,null,null,null,null,"pts",0,1,"","",0,null,"","","","","","","","","","","","","","","",""]
["<Enter Participant 37>",null,null,null,null,null,null,null,null,null,null,null,null,null,null,null,null,null,"pts",0,1,"","",0,null,"","","","","","","","","","","","","","","",""]
["<Enter Participant 38>",null,null,null,null,null,null,null,null,null,null,null,null,null,null,null,null,null,"pts",0,1,"","",0,null,"","","","","","","","","","","","","","","",""]
["<Enter Participant 39>",null,null,null,null,null,null,null,null,null,null,null,null,null,null,null,null,null,"pts",0,1,"","",0,null,"","","","","","","","","","","","","","","",""]
["<Enter Participant 40>",null,null,null,null,null,null,null,null,null,null,null,null,null,null,null,null,null,"pts",0,1,"","",0,null,"","","","","","","","","","","","","","","",""]
["<Enter Participant 41>",null,null,null,null,null,null,null,null,null,null,null,null,null,null,null,null,null,"pts",0,1,"","",0,null,"","","","","","","","","","","","","","","",""]
["<Enter Participant 42>",null,null,null,null,null,null,null,null,null,null,null,null,null,null,null,null,null,"pts",0,1,"","",0,null,"","","","","","","","","","","","","","","",""]
["<Enter Participant 43>",null,null,null,null,null,null,null,null,null,null,null,null,null,null,null,null,null,"pts",0,1,"","",0,null,"","","","","","","","","","","","","","","",""]
["<Enter Participant 44>",null,null,null,null,null,null,null,null,null,null,null,null,null,null,null,null,null,"pts",0,1,"","",0,null,"","","","","","","","","","","","","","","",""]
["<Enter Participant 45>",null,null,null,null,null,null,null,null,null,null,null,null,null,null,null,null,null,"pts",0,1,"","",0,null,"","","","","","","","","","","","","","","",""]
["<Enter Participant 46>",null,null,null,null,null,null,null,null,null,null,null,null,null,null,null,null,null,"pts",0,1,"","",0,null,"","","","","","","","","","","","","","","",""]
["<Enter Participant 47>",null,null,null,null,null,null,null,null,null,null,null,null,null,null,null,null,null,"pts",0,1,"","",0,null,"","","","","","","","","","","","","","","",""]
["<Enter Participant 48>",null,null,null,null,null,null,null,null,null,null,null,null,null,null,null,null,null,"pts",0,1,"","",0,null,"","","","","","","","","","","","","","","",""]
["<Enter Participant 49>",null,null,null,null,null,null,null,null,null,null,null,null,null,null,null,null,null,"pts",0,1,"","",0,null,"","","","","","","","","","","","","","","",""]
["<Enter Participant 50>",null,null,null,null,null,null,null,null,null,null,null,null,null,null,null,null,null,"pts",0,1,"","",0,null,"","","","","","","","","","","","","","","",""]
["<Enter Participant 51>",null,null,null,null,null,null,null,null,null,null,null,null,null,null,null,null,null,"pts",0,1,"","",0,null,"","","","","","","","","","","","","","","",""]
["<Enter Participant 52>",null,null,null,null,null,null,null,null,null,null,null,null,null,null,null,null,null,"pts",0,1,"","",0,null,"","","","","","","","","","","","","","","",""]
["<Enter Participant 53>",null,null,null,null,null,null,null,null,null,null,null,null,null,null,null,null,null,"pts",0,1,"","",0,null,"","","","","","","","","","","","","","","",""]
["<Enter Participant 54>",null,null,null,null,null,null,null,null,null,null,null,null,null,null,null,null,null,"pts",0,1,"","",0,null,"","","","","","","","","","","","","","","",""]
["<Enter Participant 55>",null,null,null,null,null,null,null,null,null,null,null,null,null,null,null,null,null,"pts",0,1,"","",0,null,"","","","","","","","","","","","","","","",""]
["<Enter Participant 56>",null,null,null,null,null,null,null,null,null,null,null,null,null,null,null,null,null,"pts",0,1,"","",0,null,"","","","","","","","","","","","","","","",""]
["<Enter Participant 57>",null,null,null,null,null,null,null,null,null,null,null,null,null,null,null,null,null,"pts",0,1,"","",0,null,"","","","","","","","","","","","","","","",""]
["<Enter Participant 58>",null,null,null,null,null,null,null,null,null,null,null,null,null,null,null,null,null,"pts",0,1,"","",0,null,"","","","","","","","","","","","","","","",""]
["<Enter Participant 59>",null,null,null,null,null,null,null,null,null,null,null,null,null,null,null,null,null,"pts",0,1,"","",0,null,"","","","","","","","","","","","","","","",""]
["<Enter Participant 60>",null,null,null,null,null,null,null,null,null,null,null,null,null,null,null,null,null,"pts",0,1,"","",0,null,"","","","","","","","","","","","","","","",""]
["<Enter Participant 61>",null,null,null,null,null,null,null,null,null,null,null,null,null,null,null,null,null,"pts",0,1,"","",0,null,"","","","","","","","","","","","","","","",""]
["<Enter Participant 62>",null,null,null,null,null,null,null,null,null,null,null,null,null,null,null,null,null,"pts",0,1,"","",0,null,"","","","","","","","","","","","","","","",""]
["<Enter Participant 63>",null,null,null,null,null,null,null,null,null,null,null,null,null,null,null,null,null,"pts",0,1,"","",0,null,"","","","","","","","","","","","","","","",""]
["<Enter Participant 64>",null,null,null,null,null,null,null,null,null,null,null,null,null,null,null,null,null,"pts",0,1,"","",0,null,"","","","","","","","","","","","","","","",""]
["<Enter Participant 65>",null,null,null,null,null,null,null,null,null,null,null,null,null,null,null,null,null,"pts",{"$f":"IF(SUM(Z75:AO75)=0,0,SUM(Z75:AO75))","v":0},{"$f":"IF(ISERROR(RANK(T75,$T$11:$T$85)),\"\",RANK(T75,$T$11:$T$85))","v":1},{"$f":"IF(ISBLANK(R75),\"\",IF(U75=1,ABS(R75-R$6),\"\"))","v":""},{"$f":"IF(ISERROR(RANK(V75,$V$11:$V$85,1)),\"\",RANK(V75,$V$11:$V$85,1))","v":""},{"$f":"IF(T75=\"\",0,T75)","v":0},null,{"$f":"IF(ISBLANK(B$6),\"\",IF(B75=B$6,1,0))","v":""},{"$f":"IF(ISBLANK(C$6),\"\",IF(C75=C$6,1,0))","v":""},{"$f":"IF(ISBLANK(D$6),\"\",IF(D75=D$6,1,0))","v":""},{"$f":"IF(ISBLANK(E$6),\"\",IF(E75=E$6,1,0))","v":""},{"$f":"IF(ISBLANK(F$6),\"\",IF(F75=F$6,1,0))","v":""},{"$f":"IF(ISBLANK(G$6),\"\",IF(G75=G$6,1,0))","v":""},{"$f":"IF(ISBLANK(H$6),\"\",IF(H75=H$6,1,0))","v":""},{"$f":"IF(ISBLANK(I$6),\"\",IF(I75=I$6,1,0))","v":""},{"$f":"IF(ISBLANK(J$6),\"\",IF(J75=J$6,1,0))","v":""},{"$f":"IF(ISBLANK(K$6),\"\",IF(K75=K$6,1,0))","v":""},{"$f":"IF(ISBLANK(L$6),\"\",IF(L75=L$6,1,0))","v":""},{"$f":"IF(ISBLANK(M$6),\"\",IF(M75=M$6,1,0))","v":""},{"$f":"IF(ISBLANK(N$6),\"\",IF(N75=N$6,1,0))","v":""},{"$f":"IF(ISBLANK(O$6),\"\",IF(O75=O$6,1,0))","v":""},{"$f":"IF(ISBLANK(P$6),\"\",IF(P75=P$6,1,0))","v":""},{"$f":"IF(ISBLANK(Q$6),\"\",IF(Q75=Q$6,1,0))","v":""}]
["<Enter Participant 66>",null,null,null,null,null,null,null,null,null,null,null,null,null,null,null,null,null,"pts",0,1,"","",0,null,"","","","","","","","","","","","","","","",""]
["<Enter Participant 67>",null,null,null,null,null,null,null,null,null,null,null,null,null,null,null,null,null,"pts",0,1,"","",0,null,"","","","","","","","","","","","","","","",""]
["<Enter Participant 68>",null,null,null,null,null,null,null,null,null,null,null,null,null,null,null,null,null,"pts",0,1,"","",0,null,"","","","","","","","","","","","","","","",""]
["<Enter Participant 69>",null,null,null,null,null,null,null,null,null,null,null,null,null,null,null,null,null,"pts",0,1,"","",0,null,"","","","","","","","","","","","","","","",""]
["<Enter Participant 70>",null,null,null,null,null,null,null,null,null,null,null,null,null,null,null,null,null,"pts",0,1,"","",0,null,"","","","","","","","","","","","","","","",""]
["<Enter Participant 71>",null,null,null,null,null,null,null,null,null,null,null,null,null,null,null,null,null,"pts",0,1,"","",0,null,"","","","","","","","","","","","","","","",""]
["<Enter Participant 72>",null,null,null,null,null,null,null,null,null,null,null,null,null,null,null,null,null,"pts",0,1,"","",0,null,"","","","","","","","","","","","","","","",""]
["<Enter Participant 73>",null,null,null,null,null,null,null,null,null,null,null,null,null,null,null,null,null,"pts",0,1,"","",0,null,"","","","","","","","","","","","","","","",""]
["<Enter Participant 74>",null,null,null,null,null,null,null,null,null,null,null,null,null,null,null,null,null,"pts",0,1,"","",0,null,"","","","","","","","","","","","","","","",""]
["<Enter Participant 75>",null,null,null,null,null,null,null,null,null,null,null,null,null,null,null,null,null,"pts",0,1,"","",0,null,"","","","","","","","","","","","","","","",""]
["<Enter Participant 76>",null,null,null,null,null,null,null,null,null,null,null,null,null,null,null,null,null,"pts",0,1,"","",0,null,{"$f":"IF(ISBLANK(B$6),\"\",IF(B86=B$6,1,0))","v":""},{"$f":"IF(ISBLANK(C$6),\"\",IF(C86=C$6,1,0))","v":""},{"$f":"IF(ISBLANK(D$6),\"\",IF(D86=D$6,1,0))","v":""},{"$f":"IF(ISBLANK(E$6),\"\",IF(E86=E$6,1,0))","v":""},{"$f":"IF(ISBLANK(F$6),\"\",IF(F86=F$6,1,0))","v":""},{"$f":"IF(ISBLANK(G$6),\"\",IF(G86=G$6,1,0))","v":""},{"$f":"IF(ISBLANK(H$6),\"\",IF(H86=H$6,1,0))","v":""},{"$f":"IF(ISBLANK(I$6),\"\",IF(I86=I$6,1,0))","v":""},{"$f":"IF(ISBLANK(J$6),\"\",IF(J86=J$6,1,0))","v":""},{"$f":"IF(ISBLANK(K$6),\"\",IF(K86=K$6,1,0))","v":""},{"$f":"IF(ISBLANK(L$6),\"\",IF(L86=L$6,1,0))","v":""},{"$f":"IF(ISBLANK(M$6),\"\",IF(M86=M$6,1,0))","v":""},{"$f":"IF(ISBLANK(N$6),\"\",IF(N86=N$6,1,0))","v":""},{"$f":"IF(ISBLANK(O$6),\"\",IF(O86=O$6,1,0))","v":""},{"$f":"IF(ISBLANK(P$6),\"\",IF(P86=P$6,1,0))","v":""},{"$f":"IF(ISBLANK(Q$6),\"\",IF(Q86=Q$6,1,0))","v":""}]
["<Enter Participant 77>",null,null,null,null,null,null,null,null,null,null,null,null,null,null,null,null,null,"pts",0,1,"","",0,null,"","","","","","","","","","","","","","","",""]
["<Enter Participant 78>",null,null,null,null,null,null,null,null,null,null,null,null,null,null,null,null,null,"pts",0,1,"","",0,null,"","","","","","","","","","","","","","","",""]
["<Enter Participant 79>",null,null,null,null,null,null,null,null,null,null,null,null,null,null,null,null,null,"pts",0,1,"","",0,null,"","","","","","","","","","","","","","","",""]
["<Enter Participant 80>",null,null,null,null,null,null,null,null,null,null,null,null,null,null,null,null,null,"pts",0,1,"","",0,null,"","","","","","","","","","","","","","","",""]
["<Enter Participant 81>",null,null,null,null,null,null,null,null,null,null,null,null,null,null,null,null,null,"pts",0,1,"","",0,null,"","","","","","","","","","","","","","","",""]
["<Enter Participant 82>",null,null,null,null,null,null,null,null,null,null,null,null,null,null,null,null,null,"pts",0,1,"","",0,null,"","","","","","","","","","","","","","","",""]
["<Enter Participant 83>",null,null,null,null,null,null,null,null,null,null,null,null,null,null,null,null,null,"pts",0,1,"","",0,null,"","","","","","","","","","","","","","","",""]
["<Enter Participant 84>",null,null,null,null,null,null,null,null,null,null,null,null,null,null,null,null,null,"pts",0,1,"","",0,null,"","","","","","","","","","","","","","","",""]
["<Enter Participant 85>",null,null,null,null,null,null,null,null,null,null,null,null,null,null,null,null,null,"pts",0,1,"","",0,null,"","","","","","","","","","","","","","","",""]
["<Enter Participant 86>",null,null,null,null,null,null,null,null,null,null,null,null,null,null,null,null,null,"pts",0,1,"","",0,null,"","","","","","","","","","","","","","","",""]
["<Enter Participant 87>",null,null,null,null,null,null,null,null,null,null,null,null,null,null,null,null,null,"pts",0,1,"","",0,null,"","","","","","","","","","","","","","","",""]
["<Enter Participant 88>",null,null,null,null,null,null,null,null,null,null,null,null,null,null,null,null,null,"pts",0,1,"","",0,null,"","","","","","","","","","","","","","","",""]
["<Enter Participant 89>",null,null,null,null,null,null,null,null,null,null,null,null,null,null,null,null,null,"pts",0,1,"","",0,null,"","","","","","","","","","","","","","","",""]
["<Enter Participant 90>",null,null,null,null,null,null,null,null,null,null,null,null,null,null,null,null,null,"pts",0,1,"","",0,null,"","","","","","","","","","","","","","","",""]
["<Enter Participant 91>",null,null,null,null,null,null,null,null,null,null,null,null,null,null,null,null,null,"pts",0,1,"","",0,null,"","","","","","","","","","","","","","","",""]
["<Enter Participant 92>",null,null,null,null,null,null,null,null,null,null,null,null,null,null,null,null,null,"pts",0,1,"","",0,null,"","","","","","","","","","","","","","","",""]
["<Enter Participant 93>",null,null,null,null,null,null,null,null,null,null,null,null,null,null,null,null,null,"pts",0,1,"","",0,null,"","","","","","","","","","","","","","","",""]
["<Enter Participant 94>",null,null,null,null,null,null,null,null,null,null,null,null,null,null,null,null,null,"pts",0,1,"","",0,null,"","","","","","","","","","","","","","","",""]
["<Enter Participant 95>",null,null,null,null,null,null,null,null,null,null,null,null,null,null,null,null,null,"pts",0,1,"","",0,null,"","","","","","","","","","","","","","","",""]
["<Enter Participant 96>",null,null,null,null,null,null,null,null,null,null,null,null,null,null,null,null,null,"pts",0,1,"","",0,null,"","","","","","","","","","","","","","","",""]
["<Enter Participant 97>",null,null,null,null,null,null,null,null,null,null,null,null,null,null,null,null,null,"pts",0,{"$f":"IF(ISERROR(RANK(T107,$T$11:$T$85)),\"\",RANK(T107,$T$11:$T$85))","v":1},{"$f":"IF(ISBLANK(R107),\"\",IF(U107=1,ABS(R107-R$6),\"\"))","v":""},{"$f":"IF(ISERROR(RANK(V107,$V$11:$V$85,1)),\"\",RANK(V107,$V$11:$V$85,1))","v":""},0,null,"","","","","","","","","","","","","","","",""]
["<Enter Participant 98>",null,null,null,null,null,null,null,null,null,null,null,null,null,null,null,null,null,"pts",0,1,"","",0,null,"","","","","","","","","","","","","","","",""]
["<Enter Participant 99>",null,null,null,null,null,null,null,null,null,null,null,null,null,null,null,null,null,"pts",0,1,"","",0,null,"","","","","","","","","","","","","","","",""]
["<Enter Participant 100>",null,null,null,null,null,null,null,null,null,null,null,null,null,null,null,null,null,"pts",0,1,"","",0,null,"","","","","","","","","","","","","","","",""]

{"sheet":"Week 2","index":1,"n_rows":110,"n_cols":41,"rows_kept":110,"cut":false,"hidden":false,"merged":[[1,17,1,18],[1,19,3,23],[4,23,9,23],[9,17,9,18]]}
["Week Lookup Column Offset",2,3,4,5,6,7,8,9,10,11,12,13,14,15,16,17,null,null,null,null,null,null,{"$f":"MID(T2,FIND(\" \",T2)+1,2)*1+18","v":20}]
[null,"GAME 1","GAME 2","GAME 3","GAME 4","GAME 5","GAME 6","GAME 7","GAME 8","GAME 9","GAME 10","GAME 11","GAME 12","GAME 13","GAME 14","GAME 15","GAME 16","SCORE",null,"Week 2"]
["VISITOR",{"$f":"IF(VLOOKUP($T$2&\" Visitors\",SCHEDULE_TABLE,B$1,FALSE)=0,\"\",VLOOKUP($T$2&\" Visitors\",SCHEDULE_TABLE,B$1,FALSE))","v":"PIT"},"MIA","DET","ATL","NO","NE","ARI","DAL","JAX","SEA","STL","KC","NYJ","HOU","CHI","PHI",null,"pts"]
[null,"at","at","at","at","at","at","at","at","at","at","at","at","at","at","at","at"]
["HOME",{"$f":"IF(VLOOKUP($T$2&\" Homes\",SCHEDULE_TABLE,B$1,FALSE)=0,\"\",VLOOKUP($T$2&\" Homes\",SCHEDULE_TABLE,B$1,FALSE))","v":"BAL"},"BUF","CAR","CIN","CLE","MIN","NYG","TEN","WAS","SD","TB","DEN","GB","OAK","SF","IND",null,"pts",null,null,null,null,"TOTAL POINTS FOR YEAR"]
["WINNER",null,null,null,null,null,null,null,null,null,null,null,null,null,null,null,null,{"$f":"IF(R3+R5=0,\"\",R3+R5)","v":""},"pts"]
[null,{"$f":"B3","v":"PIT"},"MIA","DET","ATL","NO","NE","ARI","DAL","JAX","SEA","STL","KC","NYJ","HOU","CHI","PHI"]
[null,{"$f":"B5","v":"BAL"},"BUF","CAR","CIN","CLE","MIN","NYG","TEN","WAS","SD","TB","DEN","GB","OAK","SF","IND"]
[]
["NAME","PICKS","PICKS","PICKS","PICKS","PICKS","PICKS","PICKS","PICKS","PICKS","PICKS","PICKS","PICKS","PICKS","PICKS","PICKS","PICKS","TIE-BREAK",null,"PICK PTS","PTS RANK","ABS DIFF","TIE-BREAK"]
[{"$f":"'Week 1'!A11","v":"<Enter Participant 1>"},null,null,null,null,null,null,null,null,null,null,null,null,null,null,null,null,null,"pts",{"$f":"IF(SUM(Z11:AO11)=0,0,SUM(Z11:AO11))","v":0},{"$f":"IF(ISERROR(RANK(T11,$T$11:$T$85)),\"\",RANK(T11,$T$11:$T$85))","v":1},{"$f":"IF(ISBLANK(R11),\"\",IF(U11=1,ABS(R11-R$6),\"\"))","v":""},{"$f":"IF(ISERROR(RANK(V11,$V$11:$V$85,1)),\"\",RANK(V11,$V$11:$V$85,1))","v":""},{"$f":"VLOOKUP(A11,CUMULATIVE_TABLE,X$1,FALSE)","v":0},null,{"$f":"IF(ISBLANK(B$6),\"\",IF(B11=B$6,1,0))","v":""},"","","","","","","","","","","","","","",""]
[{"$f":"'Week 1'!A12","v":"<Enter Participant 2>"},null,null,null,null,null,null,null,null,null,null,null,null,null,null,null,null,null,"pts",0,1,"","",0,null,"","","","","","","","","","","","","","","",""]
[{"$f":"'Week 1'!A13","v":"<Enter Participant 3>"},null,null,null,null,null,null,null,null,null,null,null,null,null,null,null,null,null,"pts",0,1,"","",0,null,"","","","","","","","","","","","","","","",""]
[{"$f":"'Week 1'!A14","v":"<Enter Participant 4>"},null,null,null,null,null,null,null,null,null,null,null,null,null,null,null,null,null,"pts",0,1,"","",0,null,"","","","","","","","","","","","","","","",""]
[{"$f":"'Week 1'!A15","v":"<Enter Participant 5>"},null,null,null,null,null,null,null,null,null,null,null,null,null,null,null,null,null,"pts",0,1,"","",0,null,"","","","","","","","","","","","","","","",""]
[{"$f":"'Week 1'!A16","v":"<Enter Participant 6>"},null,null,null,null,null,null,null,null,null,null,null,null,null,null,null,null,null,"pts",0,1,"","",0,null,"","","","","","","","","","","","","","","",""]
[{"$f":"'Week 1'!A17","v":"<Enter Participant 7>"},null,null,null,null,null,null,null,null,null,null,null,null,null,null,null,null,null,"pts",0,1,"","",0,null,"","","","","","","","","","","","","","","",""]
[{"$f":"'Week 1'!A18","v":"<Enter Participant 8>"},null,null,null,null,null,null,null,null,null,null,null,null,null,null,null,null,null,"pts",0,1,"","",0,null,"","","","","","","","","","","","","","","",""]
[{"$f":"'Week 1'!A19","v":"<Enter Participant 9>"},null,null,null,null,null,null,null,null,null,null,null,null,null,null,null,null,null,"pts",0,1,"","",0,null,"","","","","","","","","","","","","","","",""]
[{"$f":"'Week 1'!A20","v":"<Enter Participant 10>"},null,null,null,null,null,null,null,null,null,null,null,null,null,null,null,null,null,"pts",0,1,"","",0,null,"","","","","","","","","","","","","","","",""]
[{"$f":"'Week 1'!A21","v":"<Enter Participant 11>"},null,null,null,null,null,null,null,null,null,null,null,null,null,null,null,null,null,"pts",0,1,"","",0,null,"","","","","","","","","","","","","","","",""]
[{"$f":"'Week 1'!A22","v":"<Enter Participant 12>"},null,null,null,null,null,null,null,null,null,null,null,null,null,null,null,null,null,"pts",0,1,"","",0,null,"","","","","","","","","","","","","","","",""]
[{"$f":"'Week 1'!A23","v":"<Enter Participant 13>"},null,null,null,null,null,null,null,null,null,null,null,null,null,null,null,null,null,"pts",0,1,"","",0,null,"","","","","","","","","","","","","","","",""]
[{"$f":"'Week 1'!A24","v":"<Enter Participant 14>"},null,null,null,null,null,null,null,null,null,null,null,null,null,null,null,null,null,"pts",0,1,"","",0,null,"","","","","","","","","","","","","","","",""]
[{"$f":"'Week 1'!A25","v":"<Enter Participant 15>"},null,null,null,null,null,null,null,null,null,null,null,null,null,null,null,null,null,"pts",0,1,"","",0,null,"","","","","","","","","","","","","","","",""]
[{"$f":"'Week 1'!A26","v":"<Enter Participant 16>"},null,null,null,null,null,null,null,null,null,null,null,null,null,null,null,null,null,"pts",0,1,"","",0,null,"","","","","","","","","","","","","","","",{"$f":"IF(ISBLANK(Q$6),\"\",IF(Q26=Q$6,1,0))","v":""}]
[{"$f":"'Week 1'!A27","v":"<Enter Participant 17>"},null,null,null,null,null,null,null,null,null,null,null,null,null,null,null,null,null,"pts",0,1,"","",0,null,{"$f":"IF(ISBLANK(B$6),\"\",IF(B27=B$6,1,0))","v":""},"","","","","","","","","","","","","","",""]
[{"$f":"'Week 1'!A28","v":"<Enter Participant 18>"},null,null,null,null,null,null,null,null,null,null,null,null,null,null,null,null,null,"pts",0,1,"","",0,null,"","","","","","","","","","","","","","","",""]
[{"$f":"'Week 1'!A29","v":"<Enter Participant 19>"},null,null,null,null,null,null,null,null,null,null,null,null,null,null,null,null,null,"pts",0,1,"","",0,null,"","","","","","","","","","","","","","","",""]
[{"$f":"'Week 1'!A30","v":"<Enter Participant 20>"},null,null,null,null,null,null,null,null,null,null,null,null,null,null,null,null,null,"pts",0,1,"","",0,null,"","","","","","","","","","","","","","","",""]
[{"$f":"'Week 1'!A31","v":"<Enter Participant 21>"},null,null,null,null,null,null,null,null,null,null,null,null,null,null,null,null,null,"pts",0,1,"","",0,null,"","","","","","","","","","","","","","","",""]
[{"$f":"'Week 1'!A32","v":"<Enter Participant 22>"},null,null,null,null,null,null,null,null,null,null,null,null,null,null,null,null,null,"pts",0,1,"","",0,null,"","","","","","","","","","","","","","","",""]
[{"$f":"'Week 1'!A33","v":"<Enter Participant 23>"},null,null,null,null,null,null,null,null,null,null,null,null,null,null,null,null,null,"pts",0,1,"","",0,null,"","","","","","","","","","","","","","","",""]
[{"$f":"'Week 1'!A34","v":"<Enter Participant 24>"},null,null,null,null,null,null,null,null,null,null,null,null,null,null,null,null,null,"pts",0,1,"","",0,null,"","","","","","","","","","","","","","","",""]
[{"$f":"'Week 1'!A35","v":"<Enter Participant 25>"},null,null,null,null,null,null,null,null,null,null,null,null,null,null,null,null,null,"pts",0,1,"","",0,null,"","","","","","","","","","","","","","","",""]
[{"$f":"'Week 1'!A36","v":"<Enter Participant 26>"},null,null,null,null,null,null,null,null,null,null,null,null,null,null,null,null,null,"pts",0,1,"","",0,null,"","","","","","","","","","","","","","","",""]
[{"$f":"'Week 1'!A37","v":"<Enter Participant 27>"},null,null,null,null,null,null,null,null,null,null,null,null,null,null,null,null,null,"pts",0,1,"","",0,null,"","","","","","","","","","","","","","","",""]
[{"$f":"'Week 1'!A38","v":"<Enter Participant 28>"},null,null,null,null,null,null,null,null,null,null,null,null,null,null,null,null,null,"pts",0,1,"","",0,null,"","","","","","","","","","","","","","","",""]
[{"$f":"'Week 1'!A39","v":"<Enter Participant 29>"},null,null,null,null,null,null,null,null,null,null,null,null,null,null,null,null,null,"pts",0,1,"","",0,null,"","","","","","","","","","","","","","","",""]
[{"$f":"'Week 1'!A40","v":"<Enter Participant 30>"},null,null,null,null,null,null,null,null,null,null,null,null,null,null,null,null,null,"pts",0,1,"","",0,null,"","","","","","","","","","","","","","","",""]
[{"$f":"'Week 1'!A41","v":"<Enter Participant 31>"},null,null,null,null,null,null,null,null,null,null,null,null,null,null,null,null,null,"pts",0,1,"","",0,null,"","","","","","","","","","","","","","","",""]
[{"$f":"'Week 1'!A42","v":"<Enter Participant 32>"},null,null,null,null,null,null,null,null,null,null,null,null,null,null,null,null,null,"pts",0,1,"","",0,null,"","","","","","","","","","","","","","","",""]
[{"$f":"'Week 1'!A43","v":"<Enter Participant 33>"},null,null,null,null,null,null,null,null,null,null,null,null,null,null,null,null,null,"pts",{"$f":"IF(SUM(Z43:AO43)=0,0,SUM(Z43:AO43))","v":0},1,"","",{"$f":"VLOOKUP(A43,CUMULATIVE_TABLE,X$1,FALSE)","v":0},null,"","","","","","","","","","","","","","","",""]
[{"$f":"'Week 1'!A44","v":"<Enter Participant 34>"},null,null,null,null,null,null,null,null,null,null,null,null,null,null,null,null,null,"pts",0,1,"","",0,null,{"$f":"IF(ISBLANK(B$6),\"\",IF(B44=B$6,1,0))","v":""},"","","","","","","","","","","","","","",""]
[{"$f":"'Week 1'!A45","v":"<Enter Participant 35>"},null,null,null,null,null,null,null,null,null,null,null,null,null,null,null,null,null,"pts",0,1,"","",0,null,"","","","","","","","","","","","","","","",""]
[{"$f":"'Week 1'!A46","v":"<Enter Participant 36>"},null,null,null,null,null,null,null,null,null,null,null,null,null,null,null,null,null,"pts",0,1,"","",0,null,"","","","","","","","","","","","","","","",""]
[{"$f":"'Week 1'!A47","v":"<Enter Participant 37>"},null,null,null,null,null,null,null,null,null,null,null,null,null,null,null,null,null,"pts",0,1,"","",0,null,"","","","","","","","","","","","","","","",""]
[{"$f":"'Week 1'!A48","v":"<Enter Participant 38>"},null,null,null,null,null,null,null,null,null,null,null,null,null,null,null,null,null,"pts",0,1,"","",0,null,"","","","","","","","","","","","","","","",""]
[{"$f":"'Week 1'!A49","v":"<Enter Participant 39>"},null,null,null,null,null,null,null,null,null,null,null,null,null,null,null,null,null,"pts",0,1,"","",0,null,"","","","","","","","","","","","","","","",""]
[{"$f":"'Week 1'!A50","v":"<Enter Participant 40>"},null,null,null,null,null,null,null,null,null,null,null,null,null,null,null,null,null,"pts",0,1,"","",0,null,"","","","","","","","","","","","","","","",""]
[{"$f":"'Week 1'!A51","v":"<Enter Participant 41>"},null,null,null,null,null,null,null,null,null,null,null,null,null,null,null,null,null,"pts",0,1,"","",0,null,"","","","","","","","","","","","","","","",""]
[{"$f":"'Week 1'!A52","v":"<Enter Participant 42>"},null,null,null,null,null,null,null,null,null,null,null,null,null,null,null,null,null,"pts",0,1,"","",0,null,"","","","","","","","","","","","","","","",""]
[{"$f":"'Week 1'!A53","v":"<Enter Participant 43>"},null,null,null,null,null,null,null,null,null,null,null,null,null,null,null,null,null,"pts",0,1,"","",0,null,"","","","","","","","","","","","","","","",""]
[{"$f":"'Week 1'!A54","v":"<Enter Participant 44>"},null,null,null,null,null,null,null,null,null,null,null,null,null,null,null,null,null,"pts",0,1,"","",0,null,"","","","","","","","","","","","","","","",""]
[{"$f":"'Week 1'!A55","v":"<Enter Participant 45>"},null,null,null,null,null,null,null,null,null,null,null,null,null,null,null,null,null,"pts",0,1,"","",0,null,"","","","","","","","","","","","","","","",""]
[{"$f":"'Week 1'!A56","v":"<Enter Participant 46>"},null,null,null,null,null,null,null,null,null,null,null,null,null,null,null,null,null,"pts",0,1,"","",0,null,"","","","","","","","","","","","","","","",""]
[{"$f":"'Week 1'!A57","v":"<Enter Participant 47>"},null,null,null,null,null,null,null,null,null,null,null,null,null,null,null,null,null,"pts",0,1,"","",0,null,"","","","","","","","","","","","","","","",""]
[{"$f":"'Week 1'!A58","v":"<Enter Participant 48>"},null,null,null,null,null,null,null,null,null,null,null,null,null,null,null,null,null,"pts",0,1,"","",0,null,"","","","","","","","","","","","","","","",""]
[{"$f":"'Week 1'!A59","v":"<Enter Participant 49>"},null,null,null,null,null,null,null,null,null,null,null,null,null,null,null,null,null,"pts",0,1,"","",0,null,"","","","","","","","","","","","","","","",""]
[{"$f":"'Week 1'!A60","v":"<Enter Participant 50>"},null,null,null,null,null,null,null,null,null,null,null,null,null,null,null,null,null,"pts",0,1,"","",0,null,"","","","","","","","","","","","","","","",""]
[{"$f":"'Week 1'!A61","v":"<Enter Participant 51>"},null,null,null,null,null,null,null,null,null,null,null,null,null,null,null,null,null,"pts",0,1,"","",0,null,{"$f":"IF(ISBLANK(B$6),\"\",IF(B61=B$6,1,0))","v":""},"","","","","","","","","","","","","","",""]
[{"$f":"'Week 1'!A62","v":"<Enter Participant 52>"},null,null,null,null,null,null,null,null,null,null,null,null,null,null,null,null,null,"pts",0,1,"","",0,null,"","","","","","","","","","","","","","","",""]
[{"$f":"'Week 1'!A63","v":"<Enter Participant 53>"},null,null,null,null,null,null,null,null,null,null,null,null,null,null,null,null,null,"pts",0,1,"","",0,null,"","","","","","","","","","","","","","","",""]
[{"$f":"'Week 1'!A64","v":"<Enter Participant 54>"},null,null,null,null,null,null,null,null,null,null,null,null,null,null,null,null,null,"pts",0,1,"","",0,null,"","","","","","","","","","","","","","","",""]
[{"$f":"'Week 1'!A65","v":"<Enter Participant 55>"},null,null,null,null,null,null,null,null,null,null,null,null,null,null,null,null,null,"pts",0,1,"","",0,null,"","","","","","","","","","","","","","","",""]
[{"$f":"'Week 1'!A66","v":"<Enter Participant 56>"},null,null,null,null,null,null,null,null,null,null,null,null,null,null,null,null,null,"pts",0,1,"","",0,null,"","","","","","","","","","","","","","","",""]
[{"$f":"'Week 1'!A67","v":"<Enter Participant 57>"},null,null,null,null,null,null,null,null,null,null,null,null,null,null,null,null,null,"pts",0,1,"","",0,null,"","","","","","","","","","","","","","","",""]
[{"$f":"'Week 1'!A68","v":"<Enter Participant 58>"},null,null,null,null,null,null,null,null,null,null,null,null,null,null,null,null,null,"pts",0,1,"","",0,null,"","","","","","","","","","","","","","","",""]
[{"$f":"'Week 1'!A69","v":"<Enter Participant 59>"},null,null,null,null,null,null,null,null,null,null,null,null,null,null,null,null,null,"pts",0,1,"","",0,null,"","","","","","","","","","","","","","","",""]
[{"$f":"'Week 1'!A70","v":"<Enter Participant 60>"},null,null,null,null,null,null,null,null,null,null,null,null,null,null,null,null,null,"pts",0,1,"","",0,null,"","","","","","","","","","","","","","","",""]
[{"$f":"'Week 1'!A71","v":"<Enter Participant 61>"},null,null,null,null,null,null,null,null,null,null,null,null,null,null,null,null,null,"pts",0,1,"","",0,null,"","","","","","","","","","","","","","","",""]
[{"$f":"'Week 1'!A72","v":"<Enter Participant 62>"},null,null,null,null,null,null,null,null,null,null,null,null,null,null,null,null,null,"pts",0,1,"","",0,null,"","","","","","","","","","","","","","","",""]
[{"$f":"'Week 1'!A73","v":"<Enter Participant 63>"},null,null,null,null,null,null,null,null,null,null,null,null,null,null,null,null,null,"pts",0,1,"","",0,null,"","","","","","","","","","","","","","","",""]
[{"$f":"'Week 1'!A74","v":"<Enter Participant 64>"},null,null,null,null,null,null,null,null,null,null,null,null,null,null,null,null,null,"pts",0,1,"","",0,null,"","","","","","","","","","","","","","","",""]
[{"$f":"'Week 1'!A75","v":"<Enter Participant 65>"},null,null,null,null,null,null,null,null,null,null,null,null,null,null,null,null,null,"pts",0,{"$f":"IF(ISERROR(RANK(T75,$T$11:$T$85)),\"\",RANK(T75,$T$11:$T$85))","v":1},{"$f":"IF(ISBLANK(R75),\"\",IF(U75=1,ABS(R75-R$6),\"\"))","v":""},{"$f":"IF(ISERROR(RANK(V75,$V$11:$V$85,1)),\"\",RANK(V75,$V$11:$V$85,1))","v":""},{"$f":"VLOOKUP(A75,CUMULATIVE_TABLE,X$1,FALSE)","v":0},null,"","","","","","","","","","","","","","","",""]
[{"$f":"'Week 1'!A76","v":"<Enter Participant 66>"},null,null,null,null,null,null,null,null,null,null,null,null,null,null,null,null,null,"pts",0,1,"","",0,null,"","","","","","","","","","","","","","","",""]
[{"$f":"'Week 1'!A77","v":"<Enter Participant 67>"},null,null,null,null,null,null,null,null,null,null,null,null,null,null,null,null,null,"pts",0,1,"","",0,null,"","","","","","","","","","","","","","","",""]
[{"$f":"'Week 1'!A78","v":"<Enter Participant 68>"},null,null,null,null,null,null,null,null,null,null,null,null,null,null,null,null,null,"pts",0,1,"","",0,null,{"$f":"IF(ISBLANK(B$6),\"\",IF(B78=B$6,1,0))","v":""},"","","","","","","","","","","","","","",""]
[{"$f":"'Week 1'!A79","v":"<Enter Participant 69>"},null,null,null,null,null,null,null,null,null,null,null,null,null,null,null,null,null,"pts",0,1,"","",0,null,"","","","","","","","","","","","","","","",""]
[{"$f":"'Week 1'!A80","v":"<Enter Participant 70>"},null,null,null,null,null,null,null,null,null,null,null,null,null,null,null,null,null,"pts",0,1,"","",0,null,"","","","","","","","","","","","","","","",""]
[{"$f":"'Week 1'!A81","v":"<Enter Participant 71>"},null,null,null,null,null,null,null,null,null,null,null,null,null,null,null,null,null,"pts",0,1,"","",0,null,"","","","","","","","","","","","","","","",""]
[{"$f":"'Week 1'!A82","v":"<Enter Participant 72>"},null,null,null,null,null,null,null,null,null,null,null,null,null,null,null,null,null,"pts",0,1,"","",0,null,"","","","","","","","","","","","","","","",""]
[{"$f":"'Week 1'!A83","v":"<Enter Participant 73>"},null,null,null,null,null,null,null,null,null,null,null,null,null,null,null,null,null,"pts",0,1,"","",0,null,"","","","","","","","","","","","","","","",""]
[{"$f":"'Week 1'!A84","v":"<Enter Participant 74>"},null,null,null,null,null,null,null,null,null,null,null,null,null,null,null,null,null,"pts",0,1,"","",0,null,"","","","","","","","","","","","","","","",""]
[{"$f":"'Week 1'!A85","v":"<Enter Participant 75>"},null,null,null,null,null,null,null,null,null,null,null,null,null,null,null,null,null,"pts",0,1,"","",0,null,"","","","","","","","","","","","","","","",""]
[{"$f":"'Week 1'!A86","v":"<Enter Participant 76>"},null,null,null,null,null,null,null,null,null,null,null,null,null,null,null,null,null,"pts",0,1,"","",0,null,"","","","","","","","","","","","","","","",""]
[{"$f":"'Week 1'!A87","v":"<Enter Participant 77>"},null,null,null,null,null,null,null,null,null,null,null,null,null,null,null,null,null,"pts",0,1,"","",0,null,"","","","","","","","","","","","","","","",""]
[{"$f":"'Week 1'!A88","v":"<Enter Participant 78>"},null,null,null,null,null,null,null,null,null,null,null,null,null,null,null,null,null,"pts",0,1,"","",0,null,"","","","","","","","","","","","","","","",""]
[{"$f":"'Week 1'!A89","v":"<Enter Participant 79>"},null,null,null,null,null,null,null,null,null,null,null,null,null,null,null,null,null,"pts",0,1,"","",0,null,"","","","","","","","","","","","","","","",""]
[{"$f":"'Week 1'!A90","v":"<Enter Participant 80>"},null,null,null,null,null,null,null,null,null,null,null,null,null,null,null,null,null,"pts",0,1,"","",0,null,"","","","","","","","","","","","","","","",""]
[{"$f":"'Week 1'!A91","v":"<Enter Participant 81>"},null,null,null,null,null,null,null,null,null,null,null,null,null,null,null,null,null,"pts",0,1,"","",0,null,"","","","","","","","","","","","","","","",""]
[{"$f":"'Week 1'!A92","v":"<Enter Participant 82>"},null,null,null,null,null,null,null,null,null,null,null,null,null,null,null,null,null,"pts",0,1,"","",0,null,"","","","","","","","","","","","","","","",""]
[{"$f":"'Week 1'!A93","v":"<Enter Participant 83>"},null,null,null,null,null,null,null,null,null,null,null,null,null,null,null,null,null,"pts",0,1,"","",0,null,"","","","","","","","","","","","","","","",""]
[{"$f":"'Week 1'!A94","v":"<Enter Participant 84>"},null,null,null,null,null,null,null,null,null,null,null,null,null,null,null,null,null,"pts",0,1,"","",0,null,{"$f":"IF(ISBLANK(B$6),\"\",IF(B94=B$6,1,0))","v":""},"","","","","","","","","","","","","","",""]
[{"$f":"'Week 1'!A95","v":"<Enter Participant 85>"},null,null,null,null,null,null,null,null,null,null,null,null,null,null,null,null,null,"pts",0,1,"","",0,null,"","","","","","","","","","","","","","","",""]
[{"$f":"'Week 1'!A96","v":"<Enter Participant 86>"},null,null,null,null,null,null,null,null,null,null,null,null,null,null,null,null,null,"pts",0,1,"","",0,null,"","","","","","","","","","","","","","","",""]
[{"$f":"'Week 1'!A97","v":"<Enter Participant 87>"},null,null,null,null,null,null,null,null,null,null,null,null,null,null,null,null,null,"pts",0,1,"","",0,null,"","","","","","","","","","","","","","","",""]
[{"$f":"'Week 1'!A98","v":"<Enter Participant 88>"},null,null,null,null,null,null,null,null,null,null,null,null,null,null,null,null,null,"pts",0,1,"","",0,null,"","","","","","","","","","","","","","","",""]
[{"$f":"'Week 1'!A99","v":"<Enter Participant 89>"},null,null,null,null,null,null,null,null,null,null,null,null,null,null,null,null,null,"pts",0,1,"","",0,null,"","","","","","","","","","","","","","","",""]
[{"$f":"'Week 1'!A100","v":"<Enter Participant 90>"},null,null,null,null,null,null,null,null,null,null,null,null,null,null,null,null,null,"pts",0,1,"","",0,null,"","","","","","","","","","","","","","","",""]
[{"$f":"'Week 1'!A101","v":"<Enter Participant 91>"},null,null,null,null,null,null,null,null,null,null,null,null,null,null,null,null,null,"pts",0,1,"","",0,null,"","","","","","","","","","","","","","","",""]
[{"$f":"'Week 1'!A102","v":"<Enter Participant 92>"},null,null,null,null,null,null,null,null,null,null,null,null,null,null,null,null,null,"pts",0,1,"","",0,null,"","","","","","","","","","","","","","","",""]
[{"$f":"'Week 1'!A103","v":"<Enter Participant 93>"},null,null,null,null,null,null,null,null,null,null,null,null,null,null,null,null,null,"pts",0,1,"","",0,null,"","","","","","","","","","","","","","","",""]
[{"$f":"'Week 1'!A104","v":"<Enter Participant 94>"},null,null,null,null,null,null,null,null,null,null,null,null,null,null,null,null,null,"pts",0,1,"","",0,null,"","","","","","","","","","","","","","","",""]
[{"$f":"'Week 1'!A105","v":"<Enter Participant 95>"},null,null,null,null,null,null,null,null,null,null,null,null,null,null,null,null,null,"pts",0,1,"","",0,null,"","","","","","","","","","","","","","","",""]
[{"$f":"'Week 1'!A106","v":"<Enter Participant 96>"},null,null,null,null,null,null,null,null,null,null,null,null,null,null,null,null,null,"pts",0,1,"","",0,null,"","","","","","","","","","","","","","","",""]
[{"$f":"'Week 1'!A107","v":"<Enter Participant 97>"},null,null,null,null,null,null,null,null,null,null,null,null,null,null,null,null,null,"pts",{"$f":"IF(SUM(Z107:AO107)=0,0,SUM(Z107:AO107))","v":0},1,"","",0,null,"","","","","","","","","","","","","","","",""]
[{"$f":"'Week 1'!A108","v":"<Enter Participant 98>"},null,null,null,null,null,null,null,null,null,null,null,null,null,null,null,null,null,"pts",0,1,"","",0,null,"","","","","","","","","","","","","","","",""]
[{"$f":"'Week 1'!A109","v":"<Enter Participant 99>"},null,null,null,null,null,null,null,null,null,null,null,null,null,null,null,null,null,"pts",0,1,"","",0,null,"","","","","","","","","","","","","","","",{"$f":"IF(ISBLANK(Q$6),\"\",IF(Q109=Q$6,1,0))","v":""}]
[{"$f":"'Week 1'!A110","v":"<Enter Participant 100>"},null,null,null,null,null,null,null,null,null,null,null,null,null,null,null,null,null,"pts",0,1,"","",0,null,{"$f":"IF(ISBLANK(B$6),\"\",IF(B110=B$6,1,0))","v":""},"","","","","","","","","","","","","","",""]

{"sheet":"Week 3","index":2,"n_rows":110,"n_cols":41,"rows_kept":110,"cut":false,"hidden":false,"merged":[[1,17,1,18],[1,19,3,23],[4,23,9,23],[9,17,9,18]]}
["Week Lookup Column Offset",2,3,4,5,6,7,8,9,10,11,12,13,14,15,16,17,null,null,null,null,null,null,{"$f":"MID(T2,FIND(\" \",T2)+1,2)*1+18","v":21}]
[null,"GAME 1","GAME 2","GAME 3","GAME 4","GAME 5","GAME 6","GAME 7","GAME 8","GAME 9","GAME 10","GAME 11","GAME 12","GAME 13","GAME 14","GAME 15","GAME 16","SCORE",null,"Week 3"]
["VISITOR",{"$f":"IF(VLOOKUP($T$2&\" Visitors\",SCHEDULE_TABLE,B$1,FALSE)=0,\"\",VLOOKUP($T$2&\" Visitors\",SCHEDULE_TABLE,B$1,FALSE))","v":"TB"},"SD","TEN","BAL","GB","IND","OAK","MIN","HOU","WAS","DAL","SF","KC","DEN","PIT","CHI",null,"pts"]
[null,"at","at","at","at","at","at","at","at","at","at","at","at","at","at","at","at"]
["HOME",{"$f":"IF(VLOOKUP($T$2&\" Homes\",SCHEDULE_TABLE,B$1,FALSE)=0,\"\",VLOOKUP($T$2&\" Homes\",SCHEDULE_TABLE,B$1,FALSE))","v":"ATL"},"BUF","CIN","CLE","DET","JAX","NE","NO","NYG","PHI","STL","ARI","MIA","SEA","CAR","NYJ",null,"pts",null,null,null,null,"TOTAL POINTS FOR YEAR"]
["WINNER",null,null,null,null,null,null,null,null,null,null,null,null,null,null,null,null,{"$f":"IF(R3+R5=0,\"\",R3+R5)","v":""},"pts"]
[null,{"$f":"B3","v":"TB"},"SD","TEN","BAL","GB","IND","OAK","MIN","HOU","WAS","DAL","SF","KC","DEN","PIT","CHI"]
[null,{"$f":"B5","v":"ATL"},"BUF","CIN","CLE","DET","JAX","NE","NO","NYG","PHI","STL","ARI","MIA","SEA","CAR","NYJ"]
[]
["NAME","PICKS","PICKS","PICKS","PICKS","PICKS","PICKS","PICKS","PICKS","PICKS","PICKS","PICKS","PICKS","PICKS","PICKS","PICKS","PICKS","TIE-BREAK",null,"PICK PTS","PTS RANK","ABS DIFF","TIE-BREAK"]
[{"$f":"'Week 1'!A11","v":"<Enter Participant 1>"},null,null,null,null,null,null,null,null,null,null,null,null,null,null,null,null,null,"pts",{"$f":"IF(SUM(Z11:AO11)=0,0,SUM(Z11:AO11))","v":0},{"$f":"IF(ISERROR(RANK(T11,$T$11:$T$85)),\"\",RANK(T11,$T$11:$T$85))","v":1},{"$f":"IF(ISBLANK(R11),\"\",IF(U11=1,ABS(R11-R$6),\"\"))","v":""},{"$f":"IF(ISERROR(RANK(V11,$V$11:$V$85,1)),\"\",RANK(V11,$V$11:$V$85,1))","v":""},{"$f":"VLOOKUP(A11,CUMULATIVE_TABLE,X$1,FALSE)","v":0},null,{"$f":"IF(ISBLANK(B$6),\"\",IF(B11=B$6,1,0))","v":""},"","","","","","","","","","","","","","",""]
[{"$f":"'Week 1'!A12","v":"<Enter Participant 2>"},null,null,null,null,null,null,null,null,null,null,null,null,null,null,null,null,null,"pts",0,1,"","",0,null,"","","","","","","","","","","","","","","",""]
[{"$f":"'Week 1'!A13","v":"<Enter Participant 3>"},null,null,null,null,null,null,null,null,null,null,null,null,null,null,null,null,null,"pts",0,1,"","",0,null,"","","","","","","","","","","","","","","",""]
[{"$f":"'Week 1'!A14","v":"<Enter Participant 4>"},null,null,null,null,null,null,null,null,null,null,null,null,null,null,null,null,null,"pts",0,1,"","",0,null,"","","","","","","","","","","","","","","",""]
[{"$f":"'Week 1'!A15","v":"<Enter Participant 5>"},null,null,null,null,null,null,null,null,null,null,null,null,null,null,null,null,null,"pts",0,1,"","",0,null,"","","","","","","","","","","","","","","",""]
[{"$f":"'Week 1'!A16","v":"<Enter Participant 6>"},null,null,null,null,null,null,null,null,null,null,null,null,null,null,null,null,null,"pts",0,1,"","",0,null,"","","","","","","","","","","","","","","",""]
[{"$f":"'Week 1'!A17","v":"<Enter Participant 7>"},null,null,null,null,null,null,null,null,null,null,null,null,null,null,null,null,null,"pts",0,1,"","",0,null,"","","","","","","","","","","","","","","",""]
[{"$f":"'Week 1'!A18","v":"<Enter Participant 8>"},null,null,null,null,null,null,null,null,null,null,null,null,null,null,null,null,null,"pts",0,1,"","",0,null,"","","","","","","","","","","","","","","",""]
[{"$f":"'Week 1'!A19","v":"<Enter Participant 9>"},null,null,null,null,null,null,null,null,null,null,null,null,null,null,null,null,null,"pts",0,1,"","",0,null,"","","","","","","","","","","","","","","",""]
[{"$f":"'Week 1'!A20","v":"<Enter Participant 10>"},null,null,null,null,null,null,null,null,null,null,null,null,null,null,null,null,null,"pts",0,1,"","",0,null,"","","","","","","","","","","","","","","",""]
[{"$f":"'Week 1'!A21","v":"<Enter Participant 11>"},null,null,null,null,null,null,null,null,null,null,null,null,null,null,null,null,null,"pts",0,1,"","",0,null,"","","","","","","","","","","","","","","",""]
[{"$f":"'Week 1'!A22","v":"<Enter Participant 12>"},null,null,null,null,null,null,null,null,null,null,null,null,null,null,null,null,null,"pts",0,1,"","",0,null,"","","","","","","","","","","","","","","",""]
[{"$f":"'Week 1'!A23","v":"<Enter Participant 13>"},null,null,null,null,null,null,null,null,null,null,null,null,null,null,null,null,null,"pts",0,1,"","",0,null,"","","","","","","","","","","","","","","",""]
[{"$f":"'Week 1'!A24","v":"<Enter Participant 14>"},null,null,null,null,null,null,null,null,null,null,null,null,null,null,null,null,null,"pts",0,1,"","",0,null,"","","","","","","","","","","","","","","",""]
[{"$f":"'Week 1'!A25","v":"<Enter Participant 15>"},null,null,null,null,null,null,null,null,null,null,null,null,null,null,null,null,null,"pts",0,1,"","",0,null,"","","","","","","","","","","","","","","",""]
[{"$f":"'Week 1'!A26","v":"<Enter Participant 16>"},null,null,null,null,null,null,null,null,null,null,null,null,null,null,null,null,null,"pts",0,1,"","",0,null,"","","","","","","","","","","","","","","",{"$f":"IF(ISBLANK(Q$6),\"\",IF(Q26=Q$6,1,0))","v":""}]
[{"$f":"'Week 1'!A27","v":"<Enter Participant 17>"},null,null,null,null,null,null,null,null,null,null,null,null,null,null,null,null,null,"pts",0,1,"","",0,null,{"$f":"IF(ISBLANK(B$6),\"\",IF(B27=B$6,1,0))","v":""},"","","","","","","","","","","","","","",""]
[{"$f":"'Week 1'!A28","v":"<Enter Participant 18>"},null,null,null,null,null,null,null,null,null,null,null,null,null,null,null,null,null,"pts",0,1,"","",0,null,"","","","","","","","","","","","","","","",""]
[{"$f":"'Week 1'!A29","v":"<Enter Participant 19>"},null,null,null,null,null,null,null,null,null,null,null,null,null,null,null,null,null,"pts",0,1,"","",0,null,"","","","","","","","","","","","","","","",""]
[{"$f":"'Week 1'!A30","v":"<Enter Participant 20>"},null,null,null,null,null,null,null,null,null,null,null,null,null,null,null,null,null,"pts",0,1,"","",0,null,"","","","","","","","","","","","","","","",""]
[{"$f":"'Week 1'!A31","v":"<Enter Participant 21>"},null,null,null,null,null,null,null,null,null,null,null,null,null,null,null,null,null,"pts",0,1,"","",0,null,"","","","","","","","","","","","","","","",""]
[{"$f":"'Week 1'!A32","v":"<Enter Participant 22>"},null,null,null,null,null,null,null,null,null,null,null,null,null,null,null,null,null,"pts",0,1,"","",0,null,"","","","","","","","","","","","","","","",""]
[{"$f":"'Week 1'!A33","v":"<Enter Participant 23>"},null,null,null,null,null,null,null,null,null,null,null,null,null,null,null,null,null,"pts",0,1,"","",0,null,"","","","","","","","","","","","","","","",""]
[{"$f":"'Week 1'!A34","v":"<Enter Participant 24>"},null,null,null,null,null,null,null,null,null,null,null,null,null,null,null,null,null,"pts",0,1,"","",0,null,"","","","","","","","","","","","","","","",""]
[{"$f":"'Week 1'!A35","v":"<Enter Participant 25>"},null,null,null,null,null,null,null,null,null,null,null,null,null,null,null,null,null,"pts",0,1,"","",0,null,"","","","","","","","","","","","","","","",""]
[{"$f":"'Week 1'!A36","v":"<Enter Participant 26>"},null,null,null,null,null,null,null,null,null,null,null,null,null,null,null,null,null,"pts",0,1,"","",0,null,"","","","","","","","","","","","","","","",""]
[{"$f":"'Week 1'!A37","v":"<Enter Participant 27>"},null,null,null,null,null,null,null,null,null,null,null,null,null,null,null,null,null,"pts",0,1,"","",0,null,"","","","","","","","","","","","","","","",""]
[{"$f":"'Week 1'!A38","v":"<Enter Participant 28>"},null,null,null,null,null,null,null,null,null,null,null,null,null,null,null,null,null,"pts",0,1,"","",0,null,"","","","","","","","","","","","","","","",""]
[{"$f":"'Week 1'!A39","v":"<Enter Participant 29>"},null,null,null,null,null,null,null,null,null,null,null,null,null,null,null,null,null,"pts",0,1,"","",0,null,"","","","","","","","","","","","","","","",""]
[{"$f":"'Week 1'!A40","v":"<Enter Participant 30>"},null,null,null,null,null,null,null,null,null,null,null,null,null,null,null,null,null,"pts",0,1,"","",0,null,"","","","","","","","","","","","","","","",""]
[{"$f":"'Week 1'!A41","v":"<Enter Participant 31>"},null,null,null,null,null,null,null,null,null,null,null,null,null,null,null,null,null,"pts",0,1,"","",0,null,"","","","","","","","","","","","","","","",""]
[{"$f":"'Week 1'!A42","v":"<Enter Participant 32>"},null,null,null,null,null,null,null,null,null,null,null,null,null,null,null,null,null,"pts",0,1,"","",0,null,"","","","","","","","","","","","","","","",""]
[{"$f":"'Week 1'!A43","v":"<Enter Participant 33>"},null,null,null,null,null,null,null,null,null,null,null,null,null,null,null,null,null,"pts",{"$f":"IF(SUM(Z43:AO43)=0,0,SUM(Z43:AO43))","v":0},1,"","",{"$f":"VLOOKUP(A43,CUMULATIVE_TABLE,X$1,FALSE)","v":0},null,"","","","","","","","","","","","","","","",""]
[{"$f":"'Week 1'!A44","v":"<Enter Participant 34>"},null,null,null,null,null,null,null,null,null,null,null,null,null,null,null,null,null,"pts",0,1,"","",0,null,{"$f":"IF(ISBLANK(B$6),\"\",IF(B44=B$6,1,0))","v":""},"","","","","","","","","","","","","","",""]
[{"$f":"'Week 1'!A45","v":"<Enter Participant 35>"},null,null,null,null,null,null,null,null,null,null,null,null,null,null,null,null,null,"pts",0,1,"","",0,null,"","","","","","","","","","","","","","","",""]
[{"$f":"'Week 1'!A46","v":"<Enter Participant 36>"},null,null,null,null,null,null,null,null,null,null,null,null,null,null,null,null,null,"pts",0,1,"","",0,null,"","","","","","","","","","","","","","","",""]
[{"$f":"'Week 1'!A47","v":"<Enter Participant 37>"},null,null,null,null,null,null,null,null,null,null,null,null,null,null,null,null,null,"pts",0,1,"","",0,null,"","","","","","","","","","","","","","","",""]
[{"$f":"'Week 1'!A48","v":"<Enter Participant 38>"},null,null,null,null,null,null,null,null,null,null,null,null,null,null,null,null,null,"pts",0,1,"","",0,null,"","","","","","","","","","","","","","","",""]
[{"$f":"'Week 1'!A49","v":"<Enter Participant 39>"},null,null,null,null,null,null,null,null,null,null,null,null,null,null,null,null,null,"pts",0,1,"","",0,null,"","","","","","","","","","","","","","","",""]
[{"$f":"'Week 1'!A50","v":"<Enter Participant 40>"},null,null,null,null,null,null,null,null,null,null,null,null,null,null,null,null,null,"pts",0,1,"","",0,null,"","","","","","","","","","","","","","","",""]
[{"$f":"'Week 1'!A51","v":"<Enter Participant 41>"},null,null,null,null,null,null,null,null,null,null,null,null,null,null,null,null,null,"pts",0,1,"","",0,null,"","","","","","","","","","","","","","","",""]
[{"$f":"'Week 1'!A52","v":"<Enter Participant 42>"},null,null,null,null,null,null,null,null,null,null,null,null,null,null,null,null,null,"pts",0,1,"","",0,null,"","","","","","","","","","","","","","","",""]
[{"$f":"'Week 1'!A53","v":"<Enter Participant 43>"},null,null,null,null,null,null,null,null,null,null,null,null,null,null,null,null,null,"pts",0,1,"","",0,null,"","","","","","","","","","","","","","","",""]
[{"$f":"'Week 1'!A54","v":"<Enter Participant 44>"},null,null,null,null,null,null,null,null,null,null,null,null,null,null,null,null,null,"pts",0,1,"","",0,null,"","","","","","","","","","","","","","","",""]
[{"$f":"'Week 1'!A55","v":"<Enter Participant 45>"},null,null,null,null,null,null,null,null,null,null,null,null,null,null,null,null,null,"pts",0,1,"","",0,null,"","","","","","","","","","","","","","","",""]
[{"$f":"'Week 1'!A56","v":"<Enter Participant 46>"},null,null,null,null,null,null,null,null,null,null,null,null,null,null,null,null,null,"pts",0,1,"","",0,null,"","","","","","","","","","","","","","","",""]
[{"$f":"'Week 1'!A57","v":"<Enter Participant 47>"},null,null,null,null,null,null,null,null,null,null,null,null,null,null,null,null,null,"pts",0,1,"","",0,null,"","","","","","","","","","","","","","","",""]
[{"$f":"'Week 1'!A58","v":"<Enter Participant 48>"},null,null,null,null,null,null,null,null,null,null,null,null,null,null,null,null,null,"pts",0,1,"","",0,null,"","","","","","","","","","","","","","","",""]
[{"$f":"'Week 1'!A59","v":"<Enter Participant 49>"},null,null,null,null,null,null,null,null,null,null,null,null,null,null,null,null,null,"pts",0,1,"","",0,null,"","","","","","","","","","","","","","","",""]
[{"$f":"'Week 1'!A60","v":"<Enter Participant 50>"},null,null,null,null,null,null,null,null,null,null,null,null,null,null,null,null,null,"pts",0,1,"","",0,null,"","","","","","","","","","","","","","","",""]
[{"$f":"'Week 1'!A61","v":"<Enter Participant 51>"},null,null,null,null,null,null,null,null,null,null,null,null,null,null,null,null,null,"pts",0,1,"","",0,null,{"$f":"IF(ISBLANK(B$6),\"\",IF(B61=B$6,1,0))","v":""},"","","","","","","","","","","","","","",""]
[{"$f":"'Week 1'!A62","v":"<Enter Participant 52>"},null,null,null,null,null,null,null,null,null,null,null,null,null,null,null,null,null,"pts",0,1,"","",0,null,"","","","","","","","","","","","","","","",""]
[{"$f":"'Week 1'!A63","v":"<Enter Participant 53>"},null,null,null,null,null,null,null,null,null,null,null,null,null,null,null,null,null,"pts",0,1,"","",0,null,"","","","","","","","","","","","","","","",""]
[{"$f":"'Week 1'!A64","v":"<Enter Participant 54>"},null,null,null,null,null,null,null,null,null,null,null,null,null,null,null,null,null,"pts",0,1,"","",0,null,"","","","","","","","","","","","","","","",""]
[{"$f":"'Week 1'!A65","v":"<Enter Participant 55>"},null,null,null,null,null,null,null,null,null,null,null,null,null,null,null,null,null,"pts",0,1,"","",0,null,"","","","","","","","","","","","","","","",""]
[{"$f":"'Week 1'!A66","v":"<Enter Participant 56>"},null,null,null,null,null,null,null,null,null,null,null,null,null,null,null,null,null,"pts",0,1,"","",0,null,"","","","","","","","","","","","","","","",""]
[{"$f":"'Week 1'!A67","v":"<Enter Participant 57>"},null,null,null,null,null,null,null,null,null,null,null,null,null,null,null,null,null,"pts",0,1,"","",0,null,"","","","","","","","","","","","","","","",""]
[{"$f":"'Week 1'!A68","v":"<Enter Participant 58>"},null,null,null,null,null,null,null,null,null,null,null,null,null,null,null,null,null,"pts",0,1,"","",0,null,"","","","","","","","","","","","","","","",""]
[{"$f":"'Week 1'!A69","v":"<Enter Participant 59>"},null,null,null,null,null,null,null,null,null,null,null,null,null,null,null,null,null,"pts",0,1,"","",0,null,"","","","","","","","","","","","","","","",""]
[{"$f":"'Week 1'!A70","v":"<Enter Participant 60>"},null,null,null,null,null,null,null,null,null,null,null,null,null,null,null,null,null,"pts",0,1,"","",0,null,"","","","","","","","","","","","","","","",""]
[{"$f":"'Week 1'!A71","v":"<Enter Participant 61>"},null,null,null,null,null,null,null,null,null,null,null,null,null,null,null,null,null,"pts",0,1,"","",0,null,"","","","","","","","","","","","","","","",""]
[{"$f":"'Week 1'!A72","v":"<Enter Participant 62>"},null,null,null,null,null,null,null,null,null,null,null,null,null,null,null,null,null,"pts",0,1,"","",0,null,"","","","","","","","","","","","","","","",""]
[{"$f":"'Week 1'!A73","v":"<Enter Participant 63>"},null,null,null,null,null,null,null,null,null,null,null,null,null,null,null,null,null,"pts",0,1,"","",0,null,"","","","","","","","","","","","","","","",""]
[{"$f":"'Week 1'!A74","v":"<Enter Participant 64>"},null,null,null,null,null,null,null,null,null,null,null,null,null,null,null,null,null,"pts",0,1,"","",0,null,"","","","","","","","","","","","","","","",""]
[{"$f":"'Week 1'!A75","v":"<Enter Participant 65>"},null,null,null,null,null,null,null,null,null,null,null,null,null,null,null,null,null,"pts",0,{"$f":"IF(ISERROR(RANK(T75,$T$11:$T$85)),\"\",RANK(T75,$T$11:$T$85))","v":1},{"$f":"IF(ISBLANK(R75),\"\",IF(U75=1,ABS(R75-R$6),\"\"))","v":""},{"$f":"IF(ISERROR(RANK(V75,$V$11:$V$85,1)),\"\",RANK(V75,$V$11:$V$85,1))","v":""},{"$f":"VLOOKUP(A75,CUMULATIVE_TABLE,X$1,FALSE)","v":0},null,"","","","","","","","","","","","","","","",""]
[{"$f":"'Week 1'!A76","v":"<Enter Participant 66>"},null,null,null,null,null,null,null,null,null,null,null,null,null,null,null,null,null,"pts",0,1,"","",0,null,"","","","","","","","","","","","","","","",""]
[{"$f":"'Week 1'!A77","v":"<Enter Participant 67>"},null,null,null,null,null,null,null,null,null,null,null,null,null,null,null,null,null,"pts",0,1,"","",0,null,"","","","","","","","","","","","","","","",""]
[{"$f":"'Week 1'!A78","v":"<Enter Participant 68>"},null,null,null,null,null,null,null,null,null,null,null,null,null,null,null,null,null,"pts",0,1,"","",0,null,{"$f":"IF(ISBLANK(B$6),\"\",IF(B78=B$6,1,0))","v":""},"","","","","","","","","","","","","","",""]
[{"$f":"'Week 1'!A79","v":"<Enter Participant 69>"},null,null,null,null,null,null,null,null,null,null,null,null,null,null,null,null,null,"pts",0,1,"","",0,null,"","","","","","","","","","","","","","","",""]
[{"$f":"'Week 1'!A80","v":"<Enter Participant 70>"},null,null,null,null,null,null,null,null,null,null,null,null,null,null,null,null,null,"pts",0,1,"","",0,null,"","","","","","","","","","","","","","","",""]
[{"$f":"'Week 1'!A81","v":"<Enter Participant 71>"},null,null,null,null,null,null,null,null,null,null,null,null,null,null,null,null,null,"pts",0,1,"","",0,null,"","","","","","","","","","","","","","","",""]
[{"$f":"'Week 1'!A82","v":"<Enter Participant 72>"},null,null,null,null,null,null,null,null,null,null,null,null,null,null,null,null,null,"pts",0,1,"","",0,null,"","","","","","","","","","","","","","","",""]
[{"$f":"'Week 1'!A83","v":"<Enter Participant 73>"},null,null,null,null,null,null,null,null,null,null,null,null,null,null,null,null,null,"pts",0,1,"","",0,null,"","","","","","","","","","","","","","","",""]
[{"$f":"'Week 1'!A84","v":"<Enter Participant 74>"},null,null,null,null,null,null,null,null,null,null,null,null,null,null,null,null,null,"pts",0,1,"","",0,null,"","","","","","","","","","","","","","","",""]
[{"$f":"'Week 1'!A85","v":"<Enter Participant 75>"},null,null,null,null,null,null,null,null,null,null,null,null,null,null,null,null,null,"pts",0,1,"","",0,null,"","","","","","","","","","","","","","","",""]
[{"$f":"'Week 1'!A86","v":"<Enter Participant 76>"},null,null,null,null,null,null,null,null,null,null,null,null,null,null,null,null,null,"pts",0,1,"","",0,null,"","","","","","","","","","","","","","","",""]
[{"$f":"'Week 1'!A87","v":"<Enter Participant 77>"},null,null,null,null,null,null,null,null,null,null,null,null,null,null,null,null,null,"pts",0,1,"","",0,null,"","","","","","","","","","","","","","","",""]
[{"$f":"'Week 1'!A88","v":"<Enter Participant 78>"},null,null,null,null,null,null,null,null,null,null,null,null,null,null,null,null,null,"pts",0,1,"","",0,null,"","","","","","","","","","","","","","","",""]
[{"$f":"'Week 1'!A89","v":"<Enter Participant 79>"},null,null,null,null,null,null,null,null,null,null,null,null,null,null,null,null,null,"pts",0,1,"","",0,null,"","","","","","","","","","","","","","","",""]
[{"$f":"'Week 1'!A90","v":"<Enter Participant 80>"},null,null,null,null,null,null,null,null,null,null,null,null,null,null,null,null,null,"pts",0,1,"","",0,null,"","","","","","","","","","","","","","","",""]
[{"$f":"'Week 1'!A91","v":"<Enter Participant 81>"},null,null,null,null,null,null,null,null,null,null,null,null,null,null,null,null,null,"pts",0,1,"","",0,null,"","","","","","","","","","","","","","","",""]
[{"$f":"'Week 1'!A92","v":"<Enter Participant 82>"},null,null,null,null,null,null,null,null,null,null,null,null,null,null,null,null,null,"pts",0,1,"","",0,null,"","","","","","","","","","","","","","","",""]
[{"$f":"'Week 1'!A93","v":"<Enter Participant 83>"},null,null,null,null,null,null,null,null,null,null,null,null,null,null,null,null,null,"pts",0,1,"","",0,null,"","","","","","","","","","","","","","","",""]
[{"$f":"'Week 1'!A94","v":"<Enter Participant 84>"},null,null,null,null,null,null,null,null,null,null,null,null,null,null,null,null,null,"pts",0,1,"","",0,null,{"$f":"IF(ISBLANK(B$6),\"\",IF(B94=B$6,1,0))","v":""},"","","","","","","","","","","","","","",""]
[{"$f":"'Week 1'!A95","v":"<Enter Participant 85>"},null,null,null,null,null,null,null,null,null,null,null,null,null,null,null,null,null,"pts",0,1,"","",0,null,"","","","","","","","","","","","","","","",""]
[{"$f":"'Week 1'!A96","v":"<Enter Participant 86>"},null,null,null,null,null,null,null,null,null,null,null,null,null,null,null,null,null,"pts",0,1,"","",0,null,"","","","","","","","","","","","","","","",""]
[{"$f":"'Week 1'!A97","v":"<Enter Participant 87>"},null,null,null,null,null,null,null,null,null,null,null,null,null,null,null,null,null,"pts",0,1,"","",0,null,"","","","","","","","","","","","","","","",""]
[{"$f":"'Week 1'!A98","v":"<Enter Participant 88>"},null,null,null,null,null,null,null,null,null,null,null,null,null,null,null,null,null,"pts",0,1,"","",0,null,"","","","","","","","","","","","","","","",""]
[{"$f":"'Week 1'!A99","v":"<Enter Participant 89>"},null,null,null,null,null,null,null,null,null,null,null,null,null,null,null,null,null,"pts",0,1,"","",0,null,"","","","","","","","","","","","","","","",""]
[{"$f":"'Week 1'!A100","v":"<Enter Participant 90>"},null,null,null,null,null,null,null,null,null,null,null,null,null,null,null,null,null,"pts",0,1,"","",0,null,"","","","","","","","","","","","","","","",""]
[{"$f":"'Week 1'!A101","v":"<Enter Participant 91>"},null,null,null,null,null,null,null,null,null,null,null,null,null,null,null,null,null,"pts",0,1,"","",0,null,"","","","","","","","","","","","","","","",""]
[{"$f":"'Week 1'!A102","v":"<Enter Participant 92>"},null,null,null,null,null,null,null,null,null,null,null,null,null,null,null,null,null,"pts",0,1,"","",0,null,"","","","","","","","","","","","","","","",""]
[{"$f":"'Week 1'!A103","v":"<Enter Participant 93>"},null,null,null,null,null,null,null,null,null,null,null,null,null,null,null,null,null,"pts",0,1,"","",0,null,"","","","","","","","","","","","","","","",""]
[{"$f":"'Week 1'!A104","v":"<Enter Participant 94>"},null,null,null,null,null,null,null,null,null,null,null,null,null,null,null,null,null,"pts",0,1,"","",0,null,"","","","","","","","","","","","","","","",""]
[{"$f":"'Week 1'!A105","v":"<Enter Participant 95>"},null,null,null,null,null,null,null,null,null,null,null,null,null,null,null,null,null,"pts",0,1,"","",0,null,"","","","","","","","","","","","","","","",""]
[{"$f":"'Week 1'!A106","v":"<Enter Participant 96>"},null,null,null,null,null,null,null,null,null,null,null,null,null,null,null,null,null,"pts",0,1,"","",0,null,"","","","","","","","","","","","","","","",""]
[{"$f":"'Week 1'!A107","v":"<Enter Participant 97>"},null,null,null,null,null,null,null,null,null,null,null,null,null,null,null,null,null,"pts",{"$f":"IF(SUM(Z107:AO107)=0,0,SUM(Z107:AO107))","v":0},1,"","",0,null,"","","","","","","","","","","","","","","",""]
[{"$f":"'Week 1'!A108","v":"<Enter Participant 98>"},null,null,null,null,null,null,null,null,null,null,null,null,null,null,null,null,null,"pts",0,1,"","",0,null,"","","","","","","","","","","","","","","",""]
[{"$f":"'Week 1'!A109","v":"<Enter Participant 99>"},null,null,null,null,null,null,null,null,null,null,null,null,null,null,null,null,null,"pts",0,1,"","",0,null,"","","","","","","","","","","","","","","",{"$f":"IF(ISBLANK(Q$6),\"\",IF(Q109=Q$6,1,0))","v":""}]
[{"$f":"'Week 1'!A110","v":"<Enter Participant 100>"},null,null,null,null,null,null,null,null,null,null,null,null,null,null,null,null,null,"pts",0,1,"","",0,null,{"$f":"IF(ISBLANK(B$6),\"\",IF(B110=B$6,1,0))","v":""},"","","","","","","","","","","","","","",""]

{"sheet":"Week 4","index":3,"n_rows":110,"n_cols":41,"rows_kept":110,"cut":false,"hidden":false,"merged":[[1,17,1,18],[1,19,3,23],[4,23,9,23],[9,17,9,18]]}
["Week Lookup Column Offset",2,3,4,5,6,7,8,9,10,11,12,13,14,15,16,17,null,null,null,null,null,null,{"$f":"MID(T2,FIND(\" \",T2)+1,2)*1+18","v":22}]
[null,"GAME 1","GAME 2","GAME 3","GAME 4","GAME 5","GAME 6","GAME 7","GAME 8","GAME 9","GAME 10","GAME 11","GAME 12","GAME 13","GAME 14","GAME 15","GAME 16","SCORE",null,"Week 4"]
["VISITOR",{"$f":"IF(VLOOKUP($T$2&\" Visitors\",SCHEDULE_TABLE,B$1,FALSE)=0,\"\",VLOOKUP($T$2&\" Visitors\",SCHEDULE_TABLE,B$1,FALSE))","v":"NYG"},"CAR","GB","BUF","TEN","ATL","DET","MIA","TB","JAX","PHI","NO","NE","","","",null,"pts"]
[null,"at","at","at","at","at","at","at","at","at","at","at","at","at","at","at","at"]
["HOME",{"$f":"IF(VLOOKUP($T$2&\" Homes\",SCHEDULE_TABLE,B$1,FALSE)=0,\"\",VLOOKUP($T$2&\" Homes\",SCHEDULE_TABLE,B$1,FALSE))","v":"WAS"},"BAL","CHI","HOU","IND","MIN","NYJ","OAK","PIT","SD","SF","DAL","KC","","","",null,"pts",null,null,null,null,"TOTAL POINTS FOR YEAR"]
["WINNER",null,null,null,null,null,null,null,null,null,null,null,null,null,null,null,null,{"$f":"IF(R3+R5=0,\"\",R3+R5)","v":""},"pts"]
[null,{"$f":"B3","v":"NYG"},"CAR","GB","BUF","TEN","ATL","DET","MIA","TB","JAX","PHI","NO","NE","","",""]
[null,{"$f":"B5","v":"WAS"},"BAL","CHI","HOU","IND","MIN","NYJ","OAK","PIT","SD","SF","DAL","KC","","",""]
[]
["NAME","PICKS","PICKS","PICKS","PICKS","PICKS","PICKS","PICKS","PICKS","PICKS","PICKS","PICKS","PICKS","PICKS","PICKS","PICKS","PICKS","TIE-BREAK",null,"PICK PTS","PTS RANK","ABS DIFF","TIE-BREAK"]
[{"$f":"'Week 1'!A11","v":"<Enter Participant 1>"},null,null,null,null,null,null,null,null,null,null,null,null,null,null,null,null,null,"pts",{"$f":"IF(SUM(Z11:AO11)=0,0,SUM(Z11:AO11))","v":0},{"$f":"IF(ISERROR(RANK(T11,$T$11:$T$85)),\"\",RANK(T11,$T$11:$T$85))","v":1},{"$f":"IF(ISBLANK(R11),\"\",IF(U11=1,ABS(R11-R$6),\"\"))","v":""},{"$f":"IF(ISERROR(RANK(V11,$V$11:$V$85,1)),\"\",RANK(V11,$V$11:$V$85,1))","v":""},{"$f":"VLOOKUP(A11,CUMULATIVE_TABLE,X$1,FALSE)","v":0},null,{"$f":"IF(ISBLANK(B$6),\"\",IF(B11=B$6,1,0))","v":""},"","","","","","","","","","","","","","",""]
[{"$f":"'Week 1'!A12","v":"<Enter Participant 2>"},null,null,null,null,null,null,null,null,null,null,null,null,null,null,null,null,null,"pts",0,1,"","",0,null,"","","","","","","","","","","","","","","",""]
[{"$f":"'Week 1'!A13","v":"<Enter Participant 3>"},null,null,null,null,null,null,null,null,null,null,null,null,null,null,null,null,null,"pts",0,1,"","",0,null,"","","","","","","","","","","","","","","",""]
[{"$f":"'Week 1'!A14","v":"<Enter Participant 4>"},null,null,null,null,null,null,null,null,null,null,null,null,null,null,null,null,null,"pts",0,1,"","",0,null,"","","","","","","","","","","","","","","",""]
[{"$f":"'Week 1'!A15","v":"<Enter Participant 5>"},null,null,null,null,null,null,null,null,null,null,null,null,null,null,null,null,null,"pts",0,1,"","",0,null,"","","","","","","","","","","","","","","",""]
[{"$f":"'Week 1'!A16","v":"<Enter Participant 6>"},null,null,null,null,null,null,null,null,null,null,null,null,null,null,null,null,null,"pts",0,1,"","",0,null,"","","","","","","","","","","","","","","",""]
[{"$f":"'Week 1'!A17","v":"<Enter Participant 7>"},null,null,null,null,null,null,null,null,null,null,null,null,null,null,null,null,null,"pts",0,1,"","",0,null,"","","","","","","","","","","","","","","",""]
[{"$f":"'Week 1'!A18","v":"<Enter Participant 8>"},null,null,null,null,null,null,null,null,null,null,null,null,null,null,null,null,null,"pts",0,1,"","",0,null,"","","","","","","","","","","","","","","",""]
[{"$f":"'Week 1'!A19","v":"<Enter Participant 9>"},null,null,null,null,null,null,null,null,null,null,null,null,null,null,null,null,null,"pts",0,1,"","",0,null,"","","","","","","","","","","","","","","",""]
[{"$f":"'Week 1'!A20","v":"<Enter Participant 10>"},null,null,null,null,null,null,null,null,null,null,null,null,null,null,null,null,null,"pts",0,1,"","",0,null,"","","","","","","","","","","","","","","",""]
[{"$f":"'Week 1'!A21","v":"<Enter Participant 11>"},null,null,null,null,null,null,null,null,null,null,null,null,null,null,null,null,null,"pts",0,1,"","",0,null,"","","","","","","","","","","","","","","",""]
[{"$f":"'Week 1'!A22","v":"<Enter Participant 12>"},null,null,null,null,null,null,null,null,null,null,null,null,null,null,null,null,null,"pts",0,1,"","",0,null,"","","","","","","","","","","","","","","",""]
[{"$f":"'Week 1'!A23","v":"<Enter Participant 13>"},null,null,null,null,null,null,null,null,null,null,null,null,null,null,null,null,null,"pts",0,1,"","",0,null,"","","","","","","","","","","","","","","",""]
[{"$f":"'Week 1'!A24","v":"<Enter Participant 14>"},null,null,null,null,null,null,null,null,null,null,null,null,null,null,null,null,null,"pts",0,1,"","",0,null,"","","","","","","","","","","","","","","",""]
[{"$f":"'Week 1'!A25","v":"<Enter Participant 15>"},null,null,null,null,null,null,null,null,null,null,null,null,null,null,null,null,null,"pts",0,1,"","",0,null,"","","","","","","","","","","","","","","",""]
[{"$f":"'Week 1'!A26","v":"<Enter Participant 16>"},null,null,null,null,null,null,null,null,null,null,null,null,null,null,null,null,null,"pts",0,1,"","",0,null,"","","","","","","","","","","","","","","",{"$f":"IF(ISBLANK(Q$6),\"\",IF(Q26=Q$6,1,0))","v":""}]
[{"$f":"'Week 1'!A27","v":"<Enter Participant 17>"},null,null,null,null,null,null,null,null,null,null,null,null,null,null,null,null,null,"pts",0,1,"","",0,null,{"$f":"IF(ISBLANK(B$6),\"\",IF(B27=B$6,1,0))","v":""},"","","","","","","","","","","","","","",""]
[{"$f":"'Week 1'!A28","v":"<Enter Participant 18>"},null,null,null,null,null,null,null,null,null,null,null,null,null,null,null,null,null,"pts",0,1,"","",0,null,"","","","","","","","","","","","","","","",""]
[{"$f":"'Week 1'!A29","v":"<Enter Participant 19>"},null,null,null,null,null,null,null,null,null,null,null,null,null,null,null,null,null,"pts",0,1,"","",0,null,"","","","","","","","","","","","","","","",""]
[{"$f":"'Week 1'!A30","v":"<Enter Participant 20>"},null,null,null,null,null,null,null,null,null,null,null,null,null,null,null,null,null,"pts",0,1,"","",0,null,"","","","","","","","","","","","","","","",""]
[{"$f":"'Week 1'!A31","v":"<Enter Participant 21>"},null,null,null,null,null,null,null,null,null,null,null,null,null,null,null,null,null,"pts",0,1,"","",0,null,"","","","","","","","","","","","","","","",""]
[{"$f":"'Week 1'!A32","v":"<Enter Participant 22>"},null,null,null,null,null,null,null,null,null,null,null,null,null,null,null,null,null,"pts",0,1,"","",0,null,"","","","","","","","","","","","","","","",""]
[{"$f":"'Week 1'!A33","v":"<Enter Participant 23>"},null,null,null,null,null,null,null,null,null,null,null,null,null,null,null,null,null,"pts",0,1,"","",0,null,"","","","","","","","","","","","","","","",""]
[{"$f":"'Week 1'!A34","v":"<Enter Participant 24>"},null,null,null,null,null,null,null,null,null,null,null,null,null,null,null,null,null,"pts",0,1,"","",0,null,"","","","","","","","","","","","","","","",""]
[{"$f":"'Week 1'!A35","v":"<Enter Participant 25>"},null,null,null,null,null,null,null,null,null,null,null,null,null,null,null,null,null,"pts",0,1,"","",0,null,"","","","","","","","","","","","","","","",""]
[{"$f":"'Week 1'!A36","v":"<Enter Participant 26>"},null,null,null,null,null,null,null,null,null,null,null,null,null,null,null,null,null,"pts",0,1,"","",0,null,"","","","","","","","","","","","","","","",""]
[{"$f":"'Week 1'!A37","v":"<Enter Participant 27>"},null,null,null,null,null,null,null,null,null,null,null,null,null,null,null,null,null,"pts",0,1,"","",0,null,"","","","","","","","","","","","","","","",""]
[{"$f":"'Week 1'!A38","v":"<Enter Participant 28>"},null,null,null,null,null,null,null,null,null,null,null,null,null,null,null,null,null,"pts",0,1,"","",0,null,"","","","","","","","","","","","","","","",""]
[{"$f":"'Week 1'!A39","v":"<Enter Participant 29>"},null,null,null,null,null,null,null,null,null,null,null,null,null,null,null,null,null,"pts",0,1,"","",0,null,"","","","","","","","","","","","","","","",""]
[{"$f":"'Week 1'!A40","v":"<Enter Participant 30>"},null,null,null,null,null,null,null,null,null,null,null,null,null,null,null,null,null,"pts",0,1,"","",0,null,"","","","","","","","","","","","","","","",""]
[{"$f":"'Week 1'!A41","v":"<Enter Participant 31>"},null,null,null,null,null,null,null,null,null,null,null,null,null,null,null,null,null,"pts",0,1,"","",0,null,"","","","","","","","","","","","","","","",""]
[{"$f":"'Week 1'!A42","v":"<Enter Participant 32>"},null,null,null,null,null,null,null,null,null,null,null,null,null,null,null,null,null,"pts",0,1,"","",0,null,"","","","","","","","","","","","","","","",""]
[{"$f":"'Week 1'!A43","v":"<Enter Participant 33>"},null,null,null,null,null,null,null,null,null,null,null,null,null,null,null,null,null,"pts",{"$f":"IF(SUM(Z43:AO43)=0,0,SUM(Z43:AO43))","v":0},1,"","",{"$f":"VLOOKUP(A43,CUMULATIVE_TABLE,X$1,FALSE)","v":0},null,"","","","","","","","","","","","","","","",""]
[{"$f":"'Week 1'!A44","v":"<Enter Participant 34>"},null,null,null,null,null,null,null,null,null,null,null,null,null,null,null,null,null,"pts",0,1,"","",0,null,{"$f":"IF(ISBLANK(B$6),\"\",IF(B44=B$6,1,0))","v":""},"","","","","","","","","","","","","","",""]
[{"$f":"'Week 1'!A45","v":"<Enter Participant 35>"},null,null,null,null,null,null,null,null,null,null,null,null,null,null,null,null,null,"pts",0,1,"","",0,null,"","","","","","","","","","","","","","","",""]
[{"$f":"'Week 1'!A46","v":"<Enter Participant 36>"},null,null,null,null,null,null,null,null,null,null,null,null,null,null,null,null,null,"pts",0,1,"","",0,null,"","","","","","","","","","","","","","","",""]
[{"$f":"'Week 1'!A47","v":"<Enter Participant 37>"},null,null,null,null,null,null,null,null,null,null,null,null,null,null,null,null,null,"pts",0,1,"","",0,null,"","","","","","","","","","","","","","","",""]
[{"$f":"'Week 1'!A48","v":"<Enter Participant 38>"},null,null,null,null,null,null,null,null,null,null,null,null,null,null,null,null,null,"pts",0,1,"","",0,null,"","","","","","","","","","","","","","","",""]
[{"$f":"'Week 1'!A49","v":"<Enter Participant 39>"},null,null,null,null,null,null,null,null,null,null,null,null,null,null,null,null,null,"pts",0,1,"","",0,null,"","","","","","","","","","","","","","","",""]
[{"$f":"'Week 1'!A50","v":"<Enter Participant 40>"},null,null,null,null,null,null,null,null,null,null,null,null,null,null,null,null,null,"pts",0,1,"","",0,null,"","","","","","","","","","","","","","","",""]
[{"$f":"'Week 1'!A51","v":"<Enter Participant 41>"},null,null,null,null,null,null,null,null,null,null,null,null,null,null,null,null,null,"pts",0,1,"","",0,null,"","","","","","","","","","","","","","","",""]
[{"$f":"'Week 1'!A52","v":"<Enter Participant 42>"},null,null,null,null,null,null,null,null,null,null,null,null,null,null,null,null,null,"pts",0,1,"","",0,null,"","","","","","","","","","","","","","","",""]
[{"$f":"'Week 1'!A53","v":"<Enter Participant 43>"},null,null,null,null,null,null,null,null,null,null,null,null,null,null,null,null,null,"pts",0,1,"","",0,null,"","","","","","","","","","","","","","","",""]
[{"$f":"'Week 1'!A54","v":"<Enter Participant 44>"},null,null,null,null,null,null,null,null,null,null,null,null,null,null,null,null,null,"pts",0,1,"","",0,null,"","","","","","","","","","","","","","","",""]
[{"$f":"'Week 1'!A55","v":"<Enter Participant 45>"},null,null,null,null,null,null,null,null,null,null,null,null,null,null,null,null,null,"pts",0,1,"","",0,null,"","","","","","","","","","","","","","","",""]
[{"$f":"'Week 1'!A56","v":"<Enter Participant 46>"},null,null,null,null,null,null,null,null,null,null,null,null,null,null,null,null,null,"pts",0,1,"","",0,null,"","","","","","","","","","","","","","","",""]
[{"$f":"'Week 1'!A57","v":"<Enter Participant 47>"},null,null,null,null,null,null,null,null,null,null,null,null,null,null,null,null,null,"pts",0,1,"","",0,null,"","","","","","","","","","","","","","","",""]
[{"$f":"'Week 1'!A58","v":"<Enter Participant 48>"},null,null,null,null,null,null,null,null,null,null,null,null,null,null,null,null,null,"pts",0,1,"","",0,null,"","","","","","","","","","","","","","","",""]
[{"$f":"'Week 1'!A59","v":"<Enter Participant 49>"},null,null,null,null,null,null,null,null,null,null,null,null,null,null,null,null,null,"pts",0,1,"","",0,null,"","","","","","","","","","","","","","","",""]
[{"$f":"'Week 1'!A60","v":"<Enter Participant 50>"},null,null,null,null,null,null,null,null,null,null,null,null,null,null,null,null,null,"pts",0,1,"","",0,null,"","","","","","","","","","","","","","","",""]
[{"$f":"'Week 1'!A61","v":"<Enter Participant 51>"},null,null,null,null,null,null,null,null,null,null,null,null,null,null,null,null,null,"pts",0,1,"","",0,null,{"$f":"IF(ISBLANK(B$6),\"\",IF(B61=B$6,1,0))","v":""},"","","","","","","","","","","","","","",""]
[{"$f":"'Week 1'!A62","v":"<Enter Participant 52>"},null,null,null,null,null,null,null,null,null,null,null,null,null,null,null,null,null,"pts",0,1,"","",0,null,"","","","","","","","","","","","","","","",""]
[{"$f":"'Week 1'!A63","v":"<Enter Participant 53>"},null,null,null,null,null,null,null,null,null,null,null,null,null,null,null,null,null,"pts",0,1,"","",0,null,"","","","","","","","","","","","","","","",""]
[{"$f":"'Week 1'!A64","v":"<Enter Participant 54>"},null,null,null,null,null,null,null,null,null,null,null,null,null,null,null,null,null,"pts",0,1,"","",0,null,"","","","","","","","","","","","","","","",""]
[{"$f":"'Week 1'!A65","v":"<Enter Participant 55>"},null,null,null,null,null,null,null,null,null,null,null,null,null,null,null,null,null,"pts",0,1,"","",0,null,"","","","","","","","","","","","","","","",""]
[{"$f":"'Week 1'!A66","v":"<Enter Participant 56>"},null,null,null,null,null,null,null,null,null,null,null,null,null,null,null,null,null,"pts",0,1,"","",0,null,"","","","","","","","","","","","","","","",""]
[{"$f":"'Week 1'!A67","v":"<Enter Participant 57>"},null,null,null,null,null,null,null,null,null,null,null,null,null,null,null,null,null,"pts",0,1,"","",0,null,"","","","","","","","","","","","","","","",""]
[{"$f":"'Week 1'!A68","v":"<Enter Participant 58>"},null,null,null,null,null,null,null,null,null,null,null,null,null,null,null,null,null,"pts",0,1,"","",0,null,"","","","","","","","","","","","","","","",""]
[{"$f":"'Week 1'!A69","v":"<Enter Participant 59>"},null,null,null,null,null,null,null,null,null,null,null,null,null,null,null,null,null,"pts",0,1,"","",0,null,"","","","","","","","","","","","","","","",""]
[{"$f":"'Week 1'!A70","v":"<Enter Participant 60>"},null,null,null,null,null,null,null,null,null,null,null,null,null,null,null,null,null,"pts",0,1,"","",0,null,"","","","","","","","","","","","","","","",""]
[{"$f":"'Week 1'!A71","v":"<Enter Participant 61>"},null,null,null,null,null,null,null,null,null,null,null,null,null,null,null,null,null,"pts",0,1,"","",0,null,"","","","","","","","","","","","","","","",""]
[{"$f":"'Week 1'!A72","v":"<Enter Participant 62>"},null,null,null,null,null,null,null,null,null,null,null,null,null,null,null,null,null,"pts",0,1,"","",0,null,"","","","","","","","","","","","","","","",""]
[{"$f":"'Week 1'!A73","v":"<Enter Participant 63>"},null,null,null,null,null,null,null,null,null,null,null,null,null,null,null,null,null,"pts",0,1,"","",0,null,"","","","","","","","","","","","","","","",""]
[{"$f":"'Week 1'!A74","v":"<Enter Participant 64>"},null,null,null,null,null,null,null,null,null,null,null,null,null,null,null,null,null,"pts",0,1,"","",0,null,"","","","","","","","","","","","","","","",""]
[{"$f":"'Week 1'!A75","v":"<Enter Participant 65>"},null,null,null,null,null,null,null,null,null,null,null,null,null,null,null,null,null,"pts",0,{"$f":"IF(ISERROR(RANK(T75,$T$11:$T$85)),\"\",RANK(T75,$T$11:$T$85))","v":1},{"$f":"IF(ISBLANK(R75),\"\",IF(U75=1,ABS(R75-R$6),\"\"))","v":""},{"$f":"IF(ISERROR(RANK(V75,$V$11:$V$85,1)),\"\",RANK(V75,$V$11:$V$85,1))","v":""},{"$f":"VLOOKUP(A75,CUMULATIVE_TABLE,X$1,FALSE)","v":0},null,"","","","","","","","","","","","","","","",""]
[{"$f":"'Week 1'!A76","v":"<Enter Participant 66>"},null,null,null,null,null,null,null,null,null,null,null,null,null,null,null,null,null,"pts",0,1,"","",0,null,"","","","","","","","","","","","","","","",""]
[{"$f":"'Week 1'!A77","v":"<Enter Participant 67>"},null,null,null,null,null,null,null,null,null,null,null,null,null,null,null,null,null,"pts",0,1,"","",0,null,"","","","","","","","","","","","","","","",""]
[{"$f":"'Week 1'!A78","v":"<Enter Participant 68>"},null,null,null,null,null,null,null,null,null,null,null,null,null,null,null,null,null,"pts",0,1,"","",0,null,{"$f":"IF(ISBLANK(B$6),\"\",IF(B78=B$6,1,0))","v":""},"","","","","","","","","","","","","","",""]
[{"$f":"'Week 1'!A79","v":"<Enter Participant 69>"},null,null,null,null,null,null,null,null,null,null,null,null,null,null,null,null,null,"pts",0,1,"","",0,null,"","","","","","","","","","","","","","","",""]
[{"$f":"'Week 1'!A80","v":"<Enter Participant 70>"},null,null,null,null,null,null,null,null,null,null,null,null,null,null,null,null,null,"pts",0,1,"","",0,null,"","","","","","","","","","","","","","","",""]
[{"$f":"'Week 1'!A81","v":"<Enter Participant 71>"},null,null,null,null,null,null,null,null,null,null,null,null,null,null,null,null,null,"pts",0,1,"","",0,null,"","","","","","","","","","","","","","","",""]
[{"$f":"'Week 1'!A82","v":"<Enter Participant 72>"},null,null,null,null,null,null,null,null,null,null,null,null,null,null,null,null,null,"pts",0,1,"","",0,null,"","","","","","","","","","","","","","","",""]
[{"$f":"'Week 1'!A83","v":"<Enter Participant 73>"},null,null,null,null,null,null,null,null,null,null,null,null,null,null,null,null,null,"pts",0,1,"","",0,null,"","","","","","","","","","","","","","","",""]
[{"$f":"'Week 1'!A84","v":"<Enter Participant 74>"},null,null,null,null,null,null,null,null,null,null,null,null,null,null,null,null,null,"pts",0,1,"","",0,null,"","","","","","","","","","","","","","","",""]
[{"$f":"'Week 1'!A85","v":"<Enter Participant 75>"},null,null,null,null,null,null,null,null,null,null,null,null,null,null,null,null,null,"pts",0,1,"","",0,null,"","","","","","","","","","","","","","","",""]
[{"$f":"'Week 1'!A86","v":"<Enter Participant 76>"},null,null,null,null,null,null,null,null,null,null,null,null,null,null,null,null,null,"pts",0,1,"","",0,null,"","","","","","","","","","","","","","","",""]
[{"$f":"'Week 1'!A87","v":"<Enter Participant 77>"},null,null,null,null,null,null,null,null,null,null,null,null,null,null,null,null,null,"pts",0,1,"","",0,null,"","","","","","","","","","","","","","","",""]
[{"$f":"'Week 1'!A88","v":"<Enter Participant 78>"},null,null,null,null,null,null,null,null,null,null,null,null,null,null,null,null,null,"pts",0,1,"","",0,null,"","","","","","","","","","","","","","","",""]
[{"$f":"'Week 1'!A89","v":"<Enter Participant 79>"},null,null,null,null,null,null,null,null,null,null,null,null,null,null,null,null,null,"pts",0,1,"","",0,null,"","","","","","","","","","","","","","","",""]
[{"$f":"'Week 1'!A90","v":"<Enter Participant 80>"},null,null,null,null,null,null,null,null,null,null,null,null,null,null,null,null,null,"pts",0,1,"","",0,null,"","","","","","","","","","","","","","","",""]
[{"$f":"'Week 1'!A91","v":"<Enter Participant 81>"},null,null,null,null,null,null,null,null,null,null,null,null,null,null,null,null,null,"pts",0,1,"","",0,null,"","","","","","","","","","","","","","","",""]
[{"$f":"'Week 1'!A92","v":"<Enter Participant 82>"},null,null,null,null,null,null,null,null,null,null,null,null,null,null,null,null,null,"pts",0,1,"","",0,null,"","","","","","","","","","","","","","","",""]
[{"$f":"'Week 1'!A93","v":"<Enter Participant 83>"},null,null,null,null,null,null,null,null,null,null,null,null,null,null,null,null,null,"pts",0,1,"","",0,null,"","","","","","","","","","","","","","","",""]
[{"$f":"'Week 1'!A94","v":"<Enter Participant 84>"},null,null,null,null,null,null,null,null,null,null,null,null,null,null,null,null,null,"pts",0,1,"","",0,null,{"$f":"IF(ISBLANK(B$6),\"\",IF(B94=B$6,1,0))","v":""},"","","","","","","","","","","","","","",""]
[{"$f":"'Week 1'!A95","v":"<Enter Participant 85>"},null,null,null,null,null,null,null,null,null,null,null,null,null,null,null,null,null,"pts",0,1,"","",0,null,"","","","","","","","","","","","","","","",""]
[{"$f":"'Week 1'!A96","v":"<Enter Participant 86>"},null,null,null,null,null,null,null,null,null,null,null,null,null,null,null,null,null,"pts",0,1,"","",0,null,"","","","","","","","","","","","","","","",""]
[{"$f":"'Week 1'!A97","v":"<Enter Participant 87>"},null,null,null,null,null,null,null,null,null,null,null,null,null,null,null,null,null,"pts",0,1,"","",0,null,"","","","","","","","","","","","","","","",""]
[{"$f":"'Week 1'!A98","v":"<Enter Participant 88>"},null,null,null,null,null,null,null,null,null,null,null,null,null,null,null,null,null,"pts",0,1,"","",0,null,"","","","","","","","","","","","","","","",""]
[{"$f":"'Week 1'!A99","v":"<Enter Participant 89>"},null,null,null,null,null,null,null,null,null,null,null,null,null,null,null,null,null,"pts",0,1,"","",0,null,"","","","","","","","","","","","","","","",""]
[{"$f":"'Week 1'!A100","v":"<Enter Participant 90>"},null,null,null,null,null,null,null,null,null,null,null,null,null,null,null,null,null,"pts",0,1,"","",0,null,"","","","","","","","","","","","","","","",""]
[{"$f":"'Week 1'!A101","v":"<Enter Participant 91>"},null,null,null,null,null,null,null,null,null,null,null,null,null,null,null,null,null,"pts",0,1,"","",0,null,"","","","","","","","","","","","","","","",""]
[{"$f":"'Week 1'!A102","v":"<Enter Participant 92>"},null,null,null,null,null,null,null,null,null,null,null,null,null,null,null,null,null,"pts",0,1,"","",0,null,"","","","","","","","","","","","","","","",""]
[{"$f":"'Week 1'!A103","v":"<Enter Participant 93>"},null,null,null,null,null,null,null,null,null,null,null,null,null,null,null,null,null,"pts",0,1,"","",0,null,"","","","","","","","","","","","","","","",""]
[{"$f":"'Week 1'!A104","v":"<Enter Participant 94>"},null,null,null,null,null,null,null,null,null,null,null,null,null,null,null,null,null,"pts",0,1,"","",0,null,"","","","","","","","","","","","","","","",""]
[{"$f":"'Week 1'!A105","v":"<Enter Participant 95>"},null,null,null,null,null,null,null,null,null,null,null,null,null,null,null,null,null,"pts",0,1,"","",0,null,"","","","","","","","","","","","","","","",""]
[{"$f":"'Week 1'!A106","v":"<Enter Participant 96>"},null,null,null,null,null,null,null,null,null,null,null,null,null,null,null,null,null,"pts",0,1,"","",0,null,"","","","","","","","","","","","","","","",""]
[{"$f":"'Week 1'!A107","v":"<Enter Participant 97>"},null,null,null,null,null,null,null,null,null,null,null,null,null,null,null,null,null,"pts",{"$f":"IF(SUM(Z107:AO107)=0,0,SUM(Z107:AO107))","v":0},1,"","",0,null,"","","","","","","","","","","","","","","",""]
[{"$f":"'Week 1'!A108","v":"<Enter Participant 98>"},null,null,null,null,null,null,null,null,null,null,null,null,null,null,null,null,null,"pts",0,1,"","",0,null,"","","","","","","","","","","","","","","",""]
[{"$f":"'Week 1'!A109","v":"<Enter Participant 99>"},null,null,null,null,null,null,null,null,null,null,null,null,null,null,null,null,null,"pts",0,1,"","",0,null,"","","","","","","","","","","","","","","",{"$f":"IF(ISBLANK(Q$6),\"\",IF(Q109=Q$6,1,0))","v":""}]
[{"$f":"'Week 1'!A110","v":"<Enter Participant 100>"},null,null,null,null,null,null,null,null,null,null,null,null,null,null,null,null,null,"pts",0,1,"","",0,null,{"$f":"IF(ISBLANK(B$6),\"\",IF(B110=B$6,1,0))","v":""},"","","","","","","","","","","","","","",""]

{"sheet":"Week 5","index":4,"n_rows":110,"n_cols":41,"rows_kept":110,"cut":false,"hidden":false,"merged":[[1,17,1,18],[1,19,3,23],[4,23,9,23],[9,17,9,18]]}
["Week Lookup Column Offset",2,3,4,5,6,7,8,9,10,11,12,13,14,15,16,17,null,null,null,null,null,null,{"$f":"MID(T2,FIND(\" \",T2)+1,2)*1+18","v":23}]
[null,"GAME 1","GAME 2","GAME 3","GAME 4","GAME 5","GAME 6","GAME 7","GAME 8","GAME 9","GAME 10","GAME 11","GAME 12","GAME 13","GAME 14","GAME 15","GAME 16","SCORE",null,"Week 5"]
["VISITOR",{"$f":"IF(VLOOKUP($T$2&\" Visitors\",SCHEDULE_TABLE,B$1,FALSE)=0,\"\",VLOOKUP($T$2&\" Visitors\",SCHEDULE_TABLE,B$1,FALSE))","v":"MIN"},"CHI","HOU","BUF","BAL","PIT","TB","ATL","STL","CLE","ARI","NYJ","KC","CIN","SEA","",null,"pts"]
[null,"at","at","at","at","at","at","at","at","at","at","at","at","at","at","at","at"]
["HOME",{"$f":"IF(VLOOKUP($T$2&\" Homes\",SCHEDULE_TABLE,B$1,FALSE)=0,\"\",VLOOKUP($T$2&\" Homes\",SCHEDULE_TABLE,B$1,FALSE))","v":"GB"},"CAR","DAL","DET","IND","JAX","NO","NYG","PHI","TEN","DEN","SD","SF","NE","WAS","",null,"pts",null,null,null,null,"TOTAL POINTS FOR YEAR"]
["WINNER",null,null,null,null,null,null,null,null,null,null,null,null,null,null,null,null,{"$f":"IF(R3+R5=0,\"\",R3+R5)","v":""},"pts"]
[null,{"$f":"B3","v":"MIN"},"CHI","HOU","BUF","BAL","PIT","TB","ATL","STL","CLE","ARI","NYJ","KC","CIN","SEA",""]
[null,{"$f":"B5","v":"GB"},"CAR","DAL","DET","IND","JAX","NO","NYG","PHI","TEN","DEN","SD","SF","NE","WAS",""]
[]
["NAME","PICKS","PICKS","PICKS","PICKS","PICKS","PICKS","PICKS","PICKS","PICKS","PICKS","PICKS","PICKS","PICKS","PICKS","PICKS","PICKS","TIE-BREAK",null,"PICK PTS","PTS RANK","ABS DIFF","TIE-BREAK"]
[{"$f":"'Week 1'!A11","v":"<Enter Participant 1>"},null,null,null,null,null,null,null,null,null,null,null,null,null,null,null,null,null,"pts",{"$f":"IF(SUM(Z11:AO11)=0,0,SUM(Z11:AO11))","v":0},{"$f":"IF(ISERROR(RANK(T11,$T$11:$T$85)),\"\",RANK(T11,$T$11:$T$85))","v":1},{"$f":"IF(ISBLANK(R11),\"\",IF(U11=1,ABS(R11-R$6),\"\"))","v":""},{"$f":"IF(ISERROR(RANK(V11,$V$11:$V$85,1)),\"\",RANK(V11,$V$11:$V$85,1))","v":""},{"$f":"VLOOKUP(A11,CUMULATIVE_TABLE,X$1,FALSE)","v":0},null,{"$f":"IF(ISBLANK(B$6),\"\",IF(B11=B$6,1,0))","v":""},"","","","","","","","","","","","","","",""]
[{"$f":"'Week 1'!A12","v":"<Enter Participant 2>"},null,null,null,null,null,null,null,null,null,null,null,null,null,null,null,null,null,"pts",0,1,"","",0,null,"","","","","","","","","","","","","","","",""]
[{"$f":"'Week 1'!A13","v":"<Enter Participant 3>"},null,null,null,null,null,null,null,null,null,null,null,null,null,null,null,null,null,"pts",0,1,"","",0,null,"","","","","","","","","","","","","","","",""]
[{"$f":"'Week 1'!A14","v":"<Enter Participant 4>"},null,null,null,null,null,null,null,null,null,null,null,null,null,null,null,null,null,"pts",0,1,"","",0,null,"","","","","","","","","","","","","","","",""]
[{"$f":"'Week 1'!A15","v":"<Enter Participant 5>"},null,null,null,null,null,null,null,null,null,null,null,null,null,null,null,null,null,"pts",0,1,"","",0,null,"","","","","","","","","","","","","","","",""]
[{"$f":"'Week 1'!A16","v":"<Enter Participant 6>"},null,null,null,null,null,null,null,null,null,null,null,null,null,null,null,null,null,"pts",0,1,"","",0,null,"","","","","","","","","","","","","","","",""]
[{"$f":"'Week 1'!A17","v":"<Enter Participant 7>"},null,null,null,null,null,null,null,null,null,null,null,null,null,null,null,null,null,"pts",0,1,"","",0,null,"","","","","","","","","","","","","","","",""]
[{"$f":"'Week 1'!A18","v":"<Enter Participant 8>"},null,null,null,null,null,null,null,null,null,null,null,null,null,null,null,null,null,"pts",0,1,"","",0,null,"","","","","","","","","","","","","","","",""]
[{"$f":"'Week 1'!A19","v":"<Enter Participant 9>"},null,null,null,null,null,null,null,null,null,null,null,null,null,null,null,null,null,"pts",0,1,"","",0,null,"","","","","","","","","","","","","","","",""]
[{"$f":"'Week 1'!A20","v":"<Enter Participant 10>"},null,null,null,null,null,null,null,null,null,null,null,null,null,null,null,null,null,"pts",0,1,"","",0,null,"","","","","","","","","","","","","","","",""]
[{"$f":"'Week 1'!A21","v":"<Enter Participant 11>"},null,null,null,null,null,null,null,null,null,null,null,null,null,null,null,null,null,"pts",0,1,"","",0,null,"","","","","","","","","","","","","","","",""]
[{"$f":"'Week 1'!A22","v":"<Enter Participant 12>"},null,null,null,null,null,null,null,null,null,null,null,null,null,null,null,null,null,"pts",0,1,"","",0,null,"","","","","","","","","","","","","","","",""]
[{"$f":"'Week 1'!A23","v":"<Enter Participant 13>"},null,null,null,null,null,null,null,null,null,null,null,null,null,null,null,null,null,"pts",0,1,"","",0,null,"","","","","","","","","","","","","","","",""]
[{"$f":"'Week 1'!A24","v":"<Enter Participant 14>"},null,null,null,null,null,null,null,null,null,null,null,null,null,null,null,null,null,"pts",0,1,"","",0,null,"","","","","","","","","","","","","","","",""]
[{"$f":"'Week 1'!A25","v":"<Enter Participant 15>"},null,null,null,null,null,null,null,null,null,null,null,null,null,null,null,null,null,"pts",0,1,"","",0,null,"","","","","","","","","","","","","","","",""]
[{"$f":"'Week 1'!A26","v":"<Enter Participant 16>"},null,null,null,null,null,null,null,null,null,null,null,null,null,null,null,null,null,"pts",0,1,"","",0,null,"","","","","","","","","","","","","","","",{"$f":"IF(ISBLANK(Q$6),\"\",IF(Q26=Q$6,1,0))","v":""}]
[{"$f":"'Week 1'!A27","v":"<Enter Participant 17>"},null,null,null,null,null,null,null,null,null,null,null,null,null,null,null,null,null,"pts",0,1,"","",0,null,{"$f":"IF(ISBLANK(B$6),\"\",IF(B27=B$6,1,0))","v":""},"","","","","","","","","","","","","","",""]
[{"$f":"'Week 1'!A28","v":"<Enter Participant 18>"},null,null,null,null,null,null,null,null,null,null,null,null,null,null,null,null,null,"pts",0,1,"","",0,null,"","","","","","","","","","","","","","","",""]
[{"$f":"'Week 1'!A29","v":"<Enter Participant 19>"},null,null,null,null,null,null,null,null,null,null,null,null,null,null,null,null,null,"pts",0,1,"","",0,null,"","","","","","","","","","","","","","","",""]
[{"$f":"'Week 1'!A30","v":"<Enter Participant 20>"},null,null,null,null,null,null,null,null,null,null,null,null,null,null,null,null,null,"pts",0,1,"","",0,null,"","","","","","","","","","","","","","","",""]
[{"$f":"'Week 1'!A31","v":"<Enter Participant 21>"},null,null,null,null,null,null,null,null,null,null,null,null,null,null,null,null,null,"pts",0,1,"","",0,null,"","","","","","","","","","","","","","","",""]
[{"$f":"'Week 1'!A32","v":"<Enter Participant 22>"},null,null,null,null,null,null,null,null,null,null,null,null,null,null,null,null,null,"pts",0,1,"","",0,null,"","","","","","","","","","","","","","","",""]
[{"$f":"'Week 1'!A33","v":"<Enter Participant 23>"},null,null,null,null,null,null,null,null,null,null,null,null,null,null,null,null,null,"pts",0,1,"","",0,null,"","","","","","","","","","","","","","","",""]
[{"$f":"'Week 1'!A34","v":"<Enter Participant 24>"},null,null,null,null,null,null,null,null,null,null,null,null,null,null,null,null,null,"pts",0,1,"","",0,null,"","","","","","","","","","","","","","","",""]
[{"$f":"'Week 1'!A35","v":"<Enter Participant 25>"},null,null,null,null,null,null,null,null,null,null,null,null,null,null,null,null,null,"pts",0,1,"","",0,null,"","","","","","","","","","","","","","","",""]
[{"$f":"'Week 1'!A36","v":"<Enter Participant 26>"},null,null,null,null,null,null,null,null,null,null,null,null,null,null,null,null,null,"pts",0,1,"","",0,null,"","","","","","","","","","","","","","","",""]
[{"$f":"'Week 1'!A37","v":"<Enter Participant 27>"},null,null,null,null,null,null,null,null,null,null,null,null,null,null,null,null,null,"pts",0,1,"","",0,null,"","","","","","","","","","","","","","","",""]
[{"$f":"'Week 1'!A38","v":"<Enter Participant 28>"},null,null,null,null,null,null,null,null,null,null,null,null,null,null,null,null,null,"pts",0,1,"","",0,null,"","","","","","","","","","","","","","","",""]
[{"$f":"'Week 1'!A39","v":"<Enter Participant 29>"},null,null,null,null,null,null,null,null,null,null,null,null,null,null,null,null,null,"pts",0,1,"","",0,null,"","","","","","","","","","","","","","","",""]
[{"$f":"'Week 1'!A40","v":"<Enter Participant 30>"},null,null,null,null,null,null,null,null,null,null,null,null,null,null,null,null,null,"pts",0,1,"","",0,null,"","","","","","","","","","","","","","","",""]
[{"$f":"'Week 1'!A41","v":"<Enter Participant 31>"},null,null,null,null,null,null,null,null,null,null,null,null,null,null,null,null,null,"pts",0,1,"","",0,null,"","","","","","","","","","","","","","","",""]
[{"$f":"'Week 1'!A42","v":"<Enter Participant 32>"},null,null,null,null,null,null,null,null,null,null,null,null,null,null,null,null,null,"pts",0,1,"","",0,null,"","","","","","","","","","","","","","","",""]
[{"$f":"'Week 1'!A43","v":"<Enter Participant 33>"},null,null,null,null,null,null,null,null,null,null,null,null,null,null,null,null,null,"pts",{"$f":"IF(SUM(Z43:AO43)=0,0,SUM(Z43:AO43))","v":0},1,"","",{"$f":"VLOOKUP(A43,CUMULATIVE_TABLE,X$1,FALSE)","v":0},null,"","","","","","","","","","","","","","","",""]
[{"$f":"'Week 1'!A44","v":"<Enter Participant 34>"},null,null,null,null,null,null,null,null,null,null,null,null,null,null,null,null,null,"pts",0,1,"","",0,null,{"$f":"IF(ISBLANK(B$6),\"\",IF(B44=B$6,1,0))","v":""},"","","","","","","","","","","","","","",""]
[{"$f":"'Week 1'!A45","v":"<Enter Participant 35>"},null,null,null,null,null,null,null,null,null,null,null,null,null,null,null,null,null,"pts",0,1,"","",0,null,"","","","","","","","","","","","","","","",""]
[{"$f":"'Week 1'!A46","v":"<Enter Participant 36>"},null,null,null,null,null,null,null,null,null,null,null,null,null,null,null,null,null,"pts",0,1,"","",0,null,"","","","","","","","","","","","","","","",""]
[{"$f":"'Week 1'!A47","v":"<Enter Participant 37>"},null,null,null,null,null,null,null,null,null,null,null,null,null,null,null,null,null,"pts",0,1,"","",0,null,"","","","","","","","","","","","","","","",""]
[{"$f":"'Week 1'!A48","v":"<Enter Participant 38>"},null,null,null,null,null,null,null,null,null,null,null,null,null,null,null,null,null,"pts",0,1,"","",0,null,"","","","","","","","","","","","","","","",""]
[{"$f":"'Week 1'!A49","v":"<Enter Participant 39>"},null,null,null,null,null,null,null,null,null,null,null,null,null,null,null,null,null,"pts",0,1,"","",0,null,"","","","","","","","","","","","","","","",""]
[{"$f":"'Week 1'!A50","v":"<Enter Participant 40>"},null,null,null,null,null,null,null,null,null,null,null,null,null,null,null,null,null,"pts",0,1,"","",0,null,"","","","","","","","","","","","","","","",""]
[{"$f":"'Week 1'!A51","v":"<Enter Participant 41>"},null,null,null,null,null,null,null,null,null,null,null,null,null,null,null,null,null,"pts",0,1,"","",0,null,"","","","","","","","","","","","","","","",""]
[{"$f":"'Week 1'!A52","v":"<Enter Participant 42>"},null,null,null,null,null,null,null,null,null,null,null,null,null,null,null,null,null,"pts",0,1,"","",0,null,"","","","","","","","","","","","","","","",""]
[{"$f":"'Week 1'!A53","v":"<Enter Participant 43>"},null,null,null,null,null,null,null,null,null,null,null,null,null,null,null,null,null,"pts",0,1,"","",0,null,"","","","","","","","","","","","","","","",""]
[{"$f":"'Week 1'!A54","v":"<Enter Participant 44>"},null,null,null,null,null,null,null,null,null,null,null,null,null,null,null,null,null,"pts",0,1,"","",0,null,"","","","","","","","","","","","","","","",""]
[{"$f":"'Week 1'!A55","v":"<Enter Participant 45>"},null,null,null,null,null,null,null,null,null,null,null,null,null,null,null,null,null,"pts",0,1,"","",0,null,"","","","","","","","","","","","","","","",""]
[{"$f":"'Week 1'!A56","v":"<Enter Participant 46>"},null,null,null,null,null,null,null,null,null,null,null,null,null,null,null,null,null,"pts",0,1,"","",0,null,"","","","","","","","","","","","","","","",""]
[{"$f":"'Week 1'!A57","v":"<Enter Participant 47>"},null,null,null,null,null,null,null,null,null,null,null,null,null,null,null,null,null,"pts",0,1,"","",0,null,"","","","","","","","","","","","","","","",""]
[{"$f":"'Week 1'!A58","v":"<Enter Participant 48>"},null,null,null,null,null,null,null,null,null,null,null,null,null,null,null,null,null,"pts",0,1,"","",0,null,"","","","","","","","","","","","","","","",""]
[{"$f":"'Week 1'!A59","v":"<Enter Participant 49>"},null,null,null,null,null,null,null,null,null,null,null,null,null,null,null,null,null,"pts",0,1,"","",0,null,"","","","","","","","","","","","","","","",""]
[{"$f":"'Week 1'!A60","v":"<Enter Participant 50>"},null,null,null,null,null,null,null,null,null,null,null,null,null,null,null,null,null,"pts",0,1,"","",0,null,"","","","","","","","","","","","","","","",""]
[{"$f":"'Week 1'!A61","v":"<Enter Participant 51>"},null,null,null,null,null,null,null,null,null,null,null,null,null,null,null,null,null,"pts",0,1,"","",0,null,{"$f":"IF(ISBLANK(B$6),\"\",IF(B61=B$6,1,0))","v":""},"","","","","","","","","","","","","","",""]
[{"$f":"'Week 1'!A62","v":"<Enter Participant 52>"},null,null,null,null,null,null,null,null,null,null,null,null,null,null,null,null,null,"pts",0,1,"","",0,null,"","","","","","","","","","","","","","","",""]
[{"$f":"'Week 1'!A63","v":"<Enter Participant 53>"},null,null,null,null,null,null,null,null,null,null,null,null,null,null,null,null,null,"pts",0,1,"","",0,null,"","","","","","","","","","","","","","","",""]
[{"$f":"'Week 1'!A64","v":"<Enter Participant 54>"},null,null,null,null,null,null,null,null,null,null,null,null,null,null,null,null,null,"pts",0,1,"","",0,null,"","","","","","","","","","","","","","","",""]
[{"$f":"'Week 1'!A65","v":"<Enter Participant 55>"},null,null,null,null,null,null,null,null,null,null,null,null,null,null,null,null,null,"pts",0,1,"","",0,null,"","","","","","","","","","","","","","","",""]
[{"$f":"'Week 1'!A66","v":"<Enter Participant 56>"},null,null,null,null,null,null,null,null,null,null,null,null,null,null,null,null,null,"pts",0,1,"","",0,null,"","","","","","","","","","","","","","","",""]
[{"$f":"'Week 1'!A67","v":"<Enter Participant 57>"},null,null,null,null,null,null,null,null,null,null,null,null,null,null,null,null,null,"pts",0,1,"","",0,null,"","","","","","","","","","","","","","","",""]
[{"$f":"'Week 1'!A68","v":"<Enter Participant 58>"},null,null,null,null,null,null,null,null,null,null,null,null,null,null,null,null,null,"pts",0,1,"","",0,null,"","","","","","","","","","","","","","","",""]
[{"$f":"'Week 1'!A69","v":"<Enter Participant 59>"},null,null,null,null,null,null,null,null,null,null,null,null,null,null,null,null,null,"pts",0,1,"","",0,null,"","","","","","","","","","","","","","","",""]
[{"$f":"'Week 1'!A70","v":"<Enter Participant 60>"},null,null,null,null,null,null,null,null,null,null,null,null,null,null,null,null,null,"pts",0,1,"","",0,null,"","","","","","","","","","","","","","","",""]
[{"$f":"'Week 1'!A71","v":"<Enter Participant 61>"},null,null,null,null,null,null,null,null,null,null,null,null,null,null,null,null,null,"pts",0,1,"","",0,null,"","","","","","","","","","","","","","","",""]
[{"$f":"'Week 1'!A72","v":"<Enter Participant 62>"},null,null,null,null,null,null,null,null,null,null,null,null,null,null,null,null,null,"pts",0,1,"","",0,null,"","","","","","","","","","","","","","","",""]
[{"$f":"'Week 1'!A73","v":"<Enter Participant 63>"},null,null,null,null,null,null,null,null,null,null,null,null,null,null,null,null,null,"pts",0,1,"","",0,null,"","","","","","","","","","","","","","","",""]
[{"$f":"'Week 1'!A74","v":"<Enter Participant 64>"},null,null,null,null,null,null,null,null,null,null,null,null,null,null,null,null,null,"pts",0,1,"","",0,null,"","","","","","","","","","","","","","","",""]
[{"$f":"'Week 1'!A75","v":"<Enter Participant 65>"},null,null,null,null,null,null,null,null,null,null,null,null,null,null,null,null,null,"pts",0,{"$f":"IF(ISERROR(RANK(T75,$T$11:$T$85)),\"\",RANK(T75,$T$11:$T$85))","v":1},{"$f":"IF(ISBLANK(R75),\"\",IF(U75=1,ABS(R75-R$6),\"\"))","v":""},{"$f":"IF(ISERROR(RANK(V75,$V$11:$V$85,1)),\"\",RANK(V75,$V$11:$V$85,1))","v":""},{"$f":"VLOOKUP(A75,CUMULATIVE_TABLE,X$1,FALSE)","v":0},null,"","","","","","","","","","","","","","","",""]
[{"$f":"'Week 1'!A76","v":"<Enter Participant 66>"},null,null,null,null,null,null,null,null,null,null,null,null,null,null,null,null,null,"pts",0,1,"","",0,null,"","","","","","","","","","","","","","","",""]
[{"$f":"'Week 1'!A77","v":"<Enter Participant 67>"},null,null,null,null,null,null,null,null,null,null,null,null,null,null,null,null,null,"pts",0,1,"","",0,null,"","","","","","","","","","","","","","","",""]
[{"$f":"'Week 1'!A78","v":"<Enter Participant 68>"},null,null,null,null,null,null,null,null,null,null,null,null,null,null,null,null,null,"pts",0,1,"","",0,null,{"$f":"IF(ISBLANK(B$6),\"\",IF(B78=B$6,1,0))","v":""},"","","","","","","","","","","","","","",""]
[{"$f":"'Week 1'!A79","v":"<Enter Participant 69>"},null,null,null,null,null,null,null,null,null,null,null,null,null,null,null,null,null,"pts",0,1,"","",0,null,"","","","","","","","","","","","","","","",""]
[{"$f":"'Week 1'!A80","v":"<Enter Participant 70>"},null,null,null,null,null,null,null,null,null,null,null,null,null,null,null,null,null,"pts",0,1,"","",0,null,"","","","","","","","","","","","","","","",""]
[{"$f":"'Week 1'!A81","v":"<Enter Participant 71>"},null,null,null,null,null,null,null,null,null,null,null,null,null,null,null,null,null,"pts",0,1,"","",0,null,"","","","","","","","","","","","","","","",""]
[{"$f":"'Week 1'!A82","v":"<Enter Participant 72>"},null,null,null,null,null,null,null,null,null,null,null,null,null,null,null,null,null,"pts",0,1,"","",0,null,"","","","","","","","","","","","","","","",""]
[{"$f":"'Week 1'!A83","v":"<Enter Participant 73>"},null,null,null,null,null,null,null,null,null,null,null,null,null,null,null,null,null,"pts",0,1,"","",0,null,"","","","","","","","","","","","","","","",""]
[{"$f":"'Week 1'!A84","v":"<Enter Participant 74>"},null,null,null,null,null,null,null,null,null,null,null,null,null,null,null,null,null,"pts",0,1,"","",0,null,"","","","","","","","","","","","","","","",""]
[{"$f":"'Week 1'!A85","v":"<Enter Participant 75>"},null,null,null,null,null,null,null,null,null,null,null,null,null,null,null,null,null,"pts",0,1,"","",0,null,"","","","","","","","","","","","","","","",""]
[{"$f":"'Week 1'!A86","v":"<Enter Participant 76>"},null,null,null,null,null,null,null,null,null,null,null,null,null,null,null,null,null,"pts",0,1,"","",0,null,"","","","","","","","","","","","","","","",""]
[{"$f":"'Week 1'!A87","v":"<Enter Participant 77>"},null,null,null,null,null,null,null,null,null,null,null,null,null,null,null,null,null,"pts",0,1,"","",0,null,"","","","","","","","","","","","","","","",""]
[{"$f":"'Week 1'!A88","v":"<Enter Participant 78>"},null,null,null,null,null,null,null,null,null,null,null,null,null,null,null,null,null,"pts",0,1,"","",0,null,"","","","","","","","","","","","","","","",""]
[{"$f":"'Week 1'!A89","v":"<Enter Participant 79>"},null,null,null,null,null,null,null,null,null,null,null,null,null,null,null,null,null,"pts",0,1,"","",0,null,"","","","","","","","","","","","","","","",""]
[{"$f":"'Week 1'!A90","v":"<Enter Participant 80>"},null,null,null,null,null,null,null,null,null,null,null,null,null,null,null,null,null,"pts",0,1,"","",0,null,"","","","","","","","","","","","","","","",""]
[{"$f":"'Week 1'!A91","v":"<Enter Participant 81>"},null,null,null,null,null,null,null,null,null,null,null,null,null,null,null,null,null,"pts",0,1,"","",0,null,"","","","","","","","","","","","","","","",""]
[{"$f":"'Week 1'!A92","v":"<Enter Participant 82>"},null,null,null,null,null,null,null,null,null,null,null,null,null,null,null,null,null,"pts",0,1,"","",0,null,"","","","","","","","","","","","","","","",""]
[{"$f":"'Week 1'!A93","v":"<Enter Participant 83>"},null,null,null,null,null,null,null,null,null,null,null,null,null,null,null,null,null,"pts",0,1,"","",0,null,"","","","","","","","","","","","","","","",""]
[{"$f":"'Week 1'!A94","v":"<Enter Participant 84>"},null,null,null,null,null,null,null,null,null,null,null,null,null,null,null,null,null,"pts",0,1,"","",0,null,{"$f":"IF(ISBLANK(B$6),\"\",IF(B94=B$6,1,0))","v":""},"","","","","","","","","","","","","","",""]
[{"$f":"'Week 1'!A95","v":"<Enter Participant 85>"},null,null,null,null,null,null,null,null,null,null,null,null,null,null,null,null,null,"pts",0,1,"","",0,null,"","","","","","","","","","","","","","","",""]
[{"$f":"'Week 1'!A96","v":"<Enter Participant 86>"},null,null,null,null,null,null,null,null,null,null,null,null,null,null,null,null,null,"pts",0,1,"","",0,null,"","","","","","","","","","","","","","","",""]
[{"$f":"'Week 1'!A97","v":"<Enter Participant 87>"},null,null,null,null,null,null,null,null,null,null,null,null,null,null,null,null,null,"pts",0,1,"","",0,null,"","","","","","","","","","","","","","","",""]
[{"$f":"'Week 1'!A98","v":"<Enter Participant 88>"},null,null,null,null,null,null,null,null,null,null,null,null,null,null,null,null,null,"pts",0,1,"","",0,null,"","","","","","","","","","","","","","","",""]
[{"$f":"'Week 1'!A99","v":"<Enter Participant 89>"},null,null,null,null,null,null,null,null,null,null,null,null,null,null,null,null,null,"pts",0,1,"","",0,null,"","","","","","","","","","","","","","","",""]
[{"$f":"'Week 1'!A100","v":"<Enter Participant 90>"},null,null,null,null,null,null,null,null,null,null,null,null,null,null,null,null,null,"pts",0,1,"","",0,null,"","","","","","","","","","","","","","","",""]
[{"$f":"'Week 1'!A101","v":"<Enter Participant 91>"},null,null,null,null,null,null,null,null,null,null,null,null,null,null,null,null,null,"pts",0,1,"","",0,null,"","","","","","","","","","","","","","","",""]
[{"$f":"'Week 1'!A102","v":"<Enter Participant 92>"},null,null,null,null,null,null,null,null,null,null,null,null,null,null,null,null,null,"pts",0,1,"","",0,null,"","","","","","","","","","","","","","","",""]
[{"$f":"'Week 1'!A103","v":"<Enter Participant 93>"},null,null,null,null,null,null,null,null,null,null,null,null,null,null,null,null,null,"pts",0,1,"","",0,null,"","","","","","","","","","","","","","","",""]
[{"$f":"'Week 1'!A104","v":"<Enter Participant 94>"},null,null,null,null,null,null,null,null,null,null,null,null,null,null,null,null,null,"pts",0,1,"","",0,null,"","","","","","","","","","","","","","","",""]
[{"$f":"'Week 1'!A105","v":"<Enter Participant 95>"},null,null,null,null,null,null,null,null,null,null,null,null,null,null,null,null,null,"pts",0,1,"","",0,null,"","","","","","","","","","","","","","","",""]
[{"$f":"'Week 1'!A106","v":"<Enter Participant 96>"},null,null,null,null,null,null,null,null,null,null,null,null,null,null,null,null,null,"pts",0,1,"","",0,null,"","","","","","","","","","","","","","","",""]
[{"$f":"'Week 1'!A107","v":"<Enter Participant 97>"},null,null,null,null,null,null,null,null,null,null,null,null,null,null,null,null,null,"pts",{"$f":"IF(SUM(Z107:AO107)=0,0,SUM(Z107:AO107))","v":0},1,"","",0,null,"","","","","","","","","","","","","","","",""]
[{"$f":"'Week 1'!A108","v":"<Enter Participant 98>"},null,null,null,null,null,null,null,null,null,null,null,null,null,null,null,null,null,"pts",0,1,"","",0,null,"","","","","","","","","","","","","","","",""]
[{"$f":"'Week 1'!A109","v":"<Enter Participant 99>"},null,null,null,null,null,null,null,null,null,null,null,null,null,null,null,null,null,"pts",0,1,"","",0,null,"","","","","","","","","","","","","","","",{"$f":"IF(ISBLANK(Q$6),\"\",IF(Q109=Q$6,1,0))","v":""}]
[{"$f":"'Week 1'!A110","v":"<Enter Participant 100>"},null,null,null,null,null,null,null,null,null,null,null,null,null,null,null,null,null,"pts",0,1,"","",0,null,{"$f":"IF(ISBLANK(B$6),\"\",IF(B110=B$6,1,0))","v":""},"","","","","","","","","","","","","","",""]

{"sheet":"Week 6","index":5,"n_rows":110,"n_cols":41,"rows_kept":110,"cut":false,"hidden":false,"merged":[[1,17,1,18],[1,19,3,23],[4,23,9,23],[9,17,9,18]]}
["Week Lookup Column Offset",2,3,4,5,6,7,8,9,10,11,12,13,14,15,16,17,null,null,null,null,null,null,{"$f":"MID(T2,FIND(\" \",T2)+1,2)*1+18","v":24}]
[null,"GAME 1","GAME 2","GAME 3","GAME 4","GAME 5","GAME 6","GAME 7","GAME 8","GAME 9","GAME 10","GAME 11","GAME 12","GAME 13","GAME 14","GAME 15","GAME 16","SCORE",null,"Week 6"]
["VISITOR",{"$f":"IF(VLOOKUP($T$2&\" Visitors\",SCHEDULE_TABLE,B$1,FALSE)=0,\"\",VLOOKUP($T$2&\" Visitors\",SCHEDULE_TABLE,B$1,FALSE))","v":"IND"},"CHI","NE","CAR","PIT","GB","DET","DEN","BAL","JAX","SD","WAS","DAL","NYG","SF","",null,"pts"]
[null,"at","at","at","at","at","at","at","at","at","at","at","at","at","at","at","at"]
["HOME",{"$f":"IF(VLOOKUP($T$2&\" Homes\",SCHEDULE_TABLE,B$1,FALSE)=0,\"\",VLOOKUP($T$2&\" Homes\",SCHEDULE_TABLE,B$1,FALSE))","v":"HOU"},"ATL","BUF","CIN","CLE","MIA","MIN","NYJ","TB","TEN","OAK","ARI","SEA","PHI","STL","",null,"pts",null,null,null,null,"TOTAL POINTS FOR YEAR"]
["WINNER",null,null,null,null,null,null,null,null,null,null,null,null,null,null,null,null,{"$f":"IF(R3+R5=0,\"\",R3+R5)","v":""},"pts"]
[null,{"$f":"B3","v":"IND"},"CHI","NE","CAR","PIT","GB","DET","DEN","BAL","JAX","SD","WAS","DAL","NYG","SF",""]
[null,{"$f":"B5","v":"HOU"},"ATL","BUF","CIN","CLE","MIA","MIN","NYJ","TB","TEN","OAK","ARI","SEA","PHI","STL",""]
[]
["NAME","PICKS","PICKS","PICKS","PICKS","PICKS","PICKS","PICKS","PICKS","PICKS","PICKS","PICKS","PICKS","PICKS","PICKS","PICKS","PICKS","TIE-BREAK",null,"PICK PTS","PTS RANK","ABS DIFF","TIE-BREAK"]
[{"$f":"'Week 1'!A11","v":"<Enter Participant 1>"},null,null,null,null,null,null,null,null,null,null,null,null,null,null,null,null,null,"pts",{"$f":"IF(SUM(Z11:AO11)=0,0,SUM(Z11:AO11))","v":0},{"$f":"IF(ISERROR(RANK(T11,$T$11:$T$85)),\"\",RANK(T11,$T$11:$T$85))","v":1},{"$f":"IF(ISBLANK(R11),\"\",IF(U11=1,ABS(R11-R$6),\"\"))","v":""},{"$f":"IF(ISERROR(RANK(V11,$V$11:$V$85,1)),\"\",RANK(V11,$V$11:$V$85,1))","v":""},{"$f":"VLOOKUP(A11,CUMULATIVE_TABLE,X$1,FALSE)","v":0},null,{"$f":"IF(ISBLANK(B$6),\"\",IF(B11=B$6,1,0))","v":""},"","","","","","","","","","","","","","",""]
[{"$f":"'Week 1'!A12","v":"<Enter Participant 2>"},null,null,null,null,null,null,null,null,null,null,null,null,null,null,null,null,null,"pts",0,1,"","",0,null,"","","","","","","","","","","","","","","",""]
[{"$f":"'Week 1'!A13","v":"<Enter Participant 3>"},null,null,null,null,null,null,null,null,null,null,null,null,null,null,null,null,null,"pts",0,1,"","",0,null,"","","","","","","","","","","","","","","",""]
[{"$f":"'Week 1'!A14","v":"<Enter Participant 4>"},null,null,null,null,null,null,null,null,null,null,null,null,null,null,null,null,null,"pts",0,1,"","",0,null,"","","","","","","","","","","","","","","",""]
[{"$f":"'Week 1'!A15","v":"<Enter Participant 5>"},null,null,null,null,null,null,null,null,null,null,null,null,null,null,null,null,null,"pts",0,1,"","",0,null,"","","","","","","","","","","","","","","",""]
[{"$f":"'Week 1'!A16","v":"<Enter Participant 6>"},null,null,null,null,null,null,null,null,null,null,null,null,null,null,null,null,null,"pts",0,1,"","",0,null,"","","","","","","","","","","","","","","",""]
[{"$f":"'Week 1'!A17","v":"<Enter Participant 7>"},null,null,null,null,null,null,null,null,null,null,null,null,null,null,null,null,null,"pts",0,1,"","",0,null,"","","","","","","","","","","","","","","",""]
[{"$f":"'Week 1'!A18","v":"<Enter Participant 8>"},null,null,null,null,null,null,null,null,null,null,null,null,null,null,null,null,null,"pts",0,1,"","",0,null,"","","","","","","","","","","","","","","",""]
[{"$f":"'Week 1'!A19","v":"<Enter Participant 9>"},null,null,null,null,null,null,null,null,null,null,null,null,null,null,null,null,null,"pts",0,1,"","",0,null,"","","","","","","","","","","","","","","",""]
[{"$f":"'Week 1'!A20","v":"<Enter Participant 10>"},null,null,null,null,null,null,null,null,null,null,null,null,null,null,null,null,null,"pts",0,1,"","",0,null,"","","","","","","","","","","","","","","",""]
[{"$f":"'Week 1'!A21","v":"<Enter Participant 11>"},null,null,null,null,null,null,null,null,null,null,null,null,null,null,null,null,null,"pts",0,1,"","",0,null,"","","","","","","","","","","","","","","",""]
[{"$f":"'Week 1'!A22","v":"<Enter Participant 12>"},null,null,null,null,null,null,null,null,null,null,null,null,null,null,null,null,null,"pts",0,1,"","",0,null,"","","","","","","","","","","","","","","",""]
[{"$f":"'Week 1'!A23","v":"<Enter Participant 13>"},null,null,null,null,null,null,null,null,null,null,null,null,null,null,null,null,null,"pts",0,1,"","",0,null,"","","","","","","","","","","","","","","",""]
[{"$f":"'Week 1'!A24","v":"<Enter Participant 14>"},null,null,null,null,null,null,null,null,null,null,null,null,null,null,null,null,null,"pts",0,1,"","",0,null,"","","","","","","","","","","","","","","",""]
[{"$f":"'Week 1'!A25","v":"<Enter Participant 15>"},null,null,null,null,null,null,null,null,null,null,null,null,null,null,null,null,null,"pts",0,1,"","",0,null,"","","","","","","","","","","","","","","",""]
[{"$f":"'Week 1'!A26","v":"<Enter Participant 16>"},null,null,null,null,null,null,null,null,null,null,null,null,null,null,null,null,null,"pts",0,1,"","",0,null,"","","","","","","","","","","","","","","",{"$f":"IF(ISBLANK(Q$6),\"\",IF(Q26=Q$6,1,0))","v":""}]
[{"$f":"'Week 1'!A27","v":"<Enter Participant 17>"},null,null,null,null,null,null,null,null,null,null,null,null,null,null,null,null,null,"pts",0,1,"","",0,null,{"$f":"IF(ISBLANK(B$6),\"\",IF(B27=B$6,1,0))","v":""},"","","","","","","","","","","","","","",""]
[{"$f":"'Week 1'!A28","v":"<Enter Participant 18>"},null,null,null,null,null,null,null,null,null,null,null,null,null,null,null,null,null,"pts",0,1,"","",0,null,"","","","","","","","","","","","","","","",""]
[{"$f":"'Week 1'!A29","v":"<Enter Participant 19>"},null,null,null,null,null,null,null,null,null,null,null,null,null,null,null,null,null,"pts",0,1,"","",0,null,"","","","","","","","","","","","","","","",""]
[{"$f":"'Week 1'!A30","v":"<Enter Participant 20>"},null,null,null,null,null,null,null,null,null,null,null,null,null,null,null,null,null,"pts",0,1,"","",0,null,"","","","","","","","","","","","","","","",""]
[{"$f":"'Week 1'!A31","v":"<Enter Participant 21>"},null,null,null,null,null,null,null,null,null,null,null,null,null,null,null,null,null,"pts",0,1,"","",0,null,"","","","","","","","","","","","","","","",""]
[{"$f":"'Week 1'!A32","v":"<Enter Participant 22>"},null,null,null,null,null,null,null,null,null,null,null,null,null,null,null,null,null,"pts",0,1,"","",0,null,"","","","","","","","","","","","","","","",""]
[{"$f":"'Week 1'!A33","v":"<Enter Participant 23>"},null,null,null,null,null,null,null,null,null,null,null,null,null,null,null,null,null,"pts",0,1,"","",0,null,"","","","","","","","","","","","","","","",""]
[{"$f":"'Week 1'!A34","v":"<Enter Participant 24>"},null,null,null,null,null,null,null,null,null,null,null,null,null,null,null,null,null,"pts",0,1,"","",0,null,"","","","","","","","","","","","","","","",""]
[{"$f":"'Week 1'!A35","v":"<Enter Participant 25>"},null,null,null,null,null,null,null,null,null,null,null,null,null,null,null,null,null,"pts",0,1,"","",0,null,"","","","","","","","","","","","","","","",""]
[{"$f":"'Week 1'!A36","v":"<Enter Participant 26>"},null,null,null,null,null,null,null,null,null,null,null,null,null,null,null,null,null,"pts",0,1,"","",0,null,"","","","","","","","","","","","","","","",""]
[{"$f":"'Week 1'!A37","v":"<Enter Participant 27>"},null,null,null,null,null,null,null,null,null,null,null,null,null,null,null,null,null,"pts",0,1,"","",0,null,"","","","","","","","","","","","","","","",""]
[{"$f":"'Week 1'!A38","v":"<Enter Participant 28>"},null,null,null,null,null,null,null,null,null,null,null,null,null,null,null,null,null,"pts",0,1,"","",0,null,"","","","","","","","","","","","","","","",""]
[{"$f":"'Week 1'!A39","v":"<Enter Participant 29>"},null,null,null,null,null,null,null,null,null,null,null,null,null,null,null,null,null,"pts",0,1,"","",0,null,"","","","","","","","","","","","","","","",""]
[{"$f":"'Week 1'!A40","v":"<Enter Participant 30>"},null,null,null,null,null,null,null,null,null,null,null,null,null,null,null,null,null,"pts",0,1,"","",0,null,"","","","","","","","","","","","","","","",""]
[{"$f":"'Week 1'!A41","v":"<Enter Participant 31>"},null,null,null,null,null,null,null,null,null,null,null,null,null,null,null,null,null,"pts",0,1,"","",0,null,"","","","","","","","","","","","","","","",""]
[{"$f":"'Week 1'!A42","v":"<Enter Participant 32>"},null,null,null,null,null,null,null,null,null,null,null,null,null,null,null,null,null,"pts",0,1,"","",0,null,"","","","","","","","","","","","","","","",""]
[{"$f":"'Week 1'!A43","v":"<Enter Participant 33>"},null,null,null,null,null,null,null,null,null,null,null,null,null,null,null,null,null,"pts",{"$f":"IF(SUM(Z43:AO43)=0,0,SUM(Z43:AO43))","v":0},1,"","",{"$f":"VLOOKUP(A43,CUMULATIVE_TABLE,X$1,FALSE)","v":0},null,"","","","","","","","","","","","","","","",""]
[{"$f":"'Week 1'!A44","v":"<Enter Participant 34>"},null,null,null,null,null,null,null,null,null,null,null,null,null,null,null,null,null,"pts",0,1,"","",0,null,{"$f":"IF(ISBLANK(B$6),\"\",IF(B44=B$6,1,0))","v":""},"","","","","","","","","","","","","","",""]
[{"$f":"'Week 1'!A45","v":"<Enter Participant 35>"},null,null,null,null,null,null,null,null,null,null,null,null,null,null,null,null,null,"pts",0,1,"","",0,null,"","","","","","","","","","","","","","","",""]
[{"$f":"'Week 1'!A46","v":"<Enter Participant 36>"},null,null,null,null,null,null,null,null,null,null,null,null,null,null,null,null,null,"pts",0,1,"","",0,null,"","","","","","","","","","","","","","","",""]
[{"$f":"'Week 1'!A47","v":"<Enter Participant 37>"},null,null,null,null,null,null,null,null,null,null,null,null,null,null,null,null,null,"pts",0,1,"","",0,null,"","","","","","","","","","","","","","","",""]
[{"$f":"'Week 1'!A48","v":"<Enter Participant 38>"},null,null,null,null,null,null,null,null,null,null,null,null,null,null,null,null,null,"pts",0,1,"","",0,null,"","","","","","","","","","","","","","","",""]
[{"$f":"'Week 1'!A49","v":"<Enter Participant 39>"},null,null,null,null,null,null,null,null,null,null,null,null,null,null,null,null,null,"pts",0,1,"","",0,null,"","","","","","","","","","","","","","","",""]
[{"$f":"'Week 1'!A50","v":"<Enter Participant 40>"},null,null,null,null,null,null,null,null,null,null,null,null,null,null,null,null,null,"pts",0,1,"","",0,null,"","","","","","","","","","","","","","","",""]
[{"$f":"'Week 1'!A51","v":"<Enter Participant 41>"},null,null,null,null,null,null,null,null,null,null,null,null,null,null,null,null,null,"pts",0,1,"","",0,null,"","","","","","","","","","","","","","","",""]
[{"$f":"'Week 1'!A52","v":"<Enter Participant 42>"},null,null,null,null,null,null,null,null,null,null,null,null,null,null,null,null,null,"pts",0,1,"","",0,null,"","","","","","","","","","","","","","","",""]
[{"$f":"'Week 1'!A53","v":"<Enter Participant 43>"},null,null,null,null,null,null,null,null,null,null,null,null,null,null,null,null,null,"pts",0,1,"","",0,null,"","","","","","","","","","","","","","","",""]
[{"$f":"'Week 1'!A54","v":"<Enter Participant 44>"},null,null,null,null,null,null,null,null,null,null,null,null,null,null,null,null,null,"pts",0,1,"","",0,null,"","","","","","","","","","","","","","","",""]
[{"$f":"'Week 1'!A55","v":"<Enter Participant 45>"},null,null,null,null,null,null,null,null,null,null,null,null,null,null,null,null,null,"pts",0,1,"","",0,null,"","","","","","","","","","","","","","","",""]
[{"$f":"'Week 1'!A56","v":"<Enter Participant 46>"},null,null,null,null,null,null,null,null,null,null,null,null,null,null,null,null,null,"pts",0,1,"","",0,null,"","","","","","","","","","","","","","","",""]
[{"$f":"'Week 1'!A57","v":"<Enter Participant 47>"},null,null,null,null,null,null,null,null,null,null,null,null,null,null,null,null,null,"pts",0,1,"","",0,null,"","","","","","","","","","","","","","","",""]
[{"$f":"'Week 1'!A58","v":"<Enter Participant 48>"},null,null,null,null,null,null,null,null,null,null,null,null,null,null,null,null,null,"pts",0,1,"","",0,null,"","","","","","","","","","","","","","","",""]
[{"$f":"'Week 1'!A59","v":"<Enter Participant 49>"},null,null,null,null,null,null,null,null,null,null,null,null,null,null,null,null,null,"pts",0,1,"","",0,null,"","","","","","","","","","","","","","","",""]
[{"$f":"'Week 1'!A60","v":"<Enter Participant 50>"},null,null,null,null,null,null,null,null,null,null,null,null,null,null,null,null,null,"pts",0,1,"","",0,null,"","","","","","","","","","","","","","","",""]
[{"$f":"'Week 1'!A61","v":"<Enter Participant 51>"},null,null,null,null,null,null,null,null,null,null,null,null,null,null,null,null,null,"pts",0,1,"","",0,null,{"$f":"IF(ISBLANK(B$6),\"\",IF(B61=B$6,1,0))","v":""},"","","","","","","","","","","","","","",""]
[{"$f":"'Week 1'!A62","v":"<Enter Participant 52>"},null,null,null,null,null,null,null,null,null,null,null,null,null,null,null,null,null,"pts",0,1,"","",0,null,"","","","","","","","","","","","","","","",""]
[{"$f":"'Week 1'!A63","v":"<Enter Participant 53>"},null,null,null,null,null,null,null,null,null,null,null,null,null,null,null,null,null,"pts",0,1,"","",0,null,"","","","","","","","","","","","","","","",""]
[{"$f":"'Week 1'!A64","v":"<Enter Participant 54>"},null,null,null,null,null,null,null,null,null,null,null,null,null,null,null,null,null,"pts",0,1,"","",0,null,"","","","","","","","","","","","","","","",""]
[{"$f":"'Week 1'!A65","v":"<Enter Participant 55>"},null,null,null,null,null,null,null,null,null,null,null,null,null,null,null,null,null,"pts",0,1,"","",0,null,"","","","","","","","","","","","","","","",""]
[{"$f":"'Week 1'!A66","v":"<Enter Participant 56>"},null,null,null,null,null,null,null,null,null,null,null,null,null,null,null,null,null,"pts",0,1,"","",0,null,"","","","","","","","","","","","","","","",""]
[{"$f":"'Week 1'!A67","v":"<Enter Participant 57>"},null,null,null,null,null,null,null,null,null,null,null,null,null,null,null,null,null,"pts",0,1,"","",0,null,"","","","","","","","","","","","","","","",""]
[{"$f":"'Week 1'!A68","v":"<Enter Participant 58>"},null,null,null,null,null,null,null,null,null,null,null,null,null,null,null,null,null,"pts",0,1,"","",0,null,"","","","","","","","","","","","","","","",""]
[{"$f":"'Week 1'!A69","v":"<Enter Participant 59>"},null,null,null,null,null,null,null,null,null,null,null,null,null,null,null,null,null,"pts",0,1,"","",0,null,"","","","","","","","","","","","","","","",""]
[{"$f":"'Week 1'!A70","v":"<Enter Participant 60>"},null,null,null,null,null,null,null,null,null,null,null,null,null,null,null,null,null,"pts",0,1,"","",0,null,"","","","","","","","","","","","","","","",""]
[{"$f":"'Week 1'!A71","v":"<Enter Participant 61>"},null,null,null,null,null,null,null,null,null,null,null,null,null,null,null,null,null,"pts",0,1,"","",0,null,"","","","","","","","","","","","","","","",""]
[{"$f":"'Week 1'!A72","v":"<Enter Participant 62>"},null,null,null,null,null,null,null,null,null,null,null,null,null,null,null,null,null,"pts",0,1,"","",0,null,"","","","","","","","","","","","","","","",""]
[{"$f":"'Week 1'!A73","v":"<Enter Participant 63>"},null,null,null,null,null,null,null,null,null,null,null,null,null,null,null,null,null,"pts",0,1,"","",0,null,"","","","","","","","","","","","","","","",""]
[{"$f":"'Week 1'!A74","v":"<Enter Participant 64>"},null,null,null,null,null,null,null,null,null,null,null,null,null,null,null,null,null,"pts",0,1,"","",0,null,"","","","","","","","","","","","","","","",""]
[{"$f":"'Week 1'!A75","v":"<Enter Participant 65>"},null,null,null,null,null,null,null,null,null,null,null,null,null,null,null,null,null,"pts",0,{"$f":"IF(ISERROR(RANK(T75,$T$11:$T$85)),\"\",RANK(T75,$T$11:$T$85))","v":1},{"$f":"IF(ISBLANK(R75),\"\",IF(U75=1,ABS(R75-R$6),\"\"))","v":""},{"$f":"IF(ISERROR(RANK(V75,$V$11:$V$85,1)),\"\",RANK(V75,$V$11:$V$85,1))","v":""},{"$f":"VLOOKUP(A75,CUMULATIVE_TABLE,X$1,FALSE)","v":0},null,"","","","","","","","","","","","","","","",""]
[{"$f":"'Week 1'!A76","v":"<Enter Participant 66>"},null,null,null,null,null,null,null,null,null,null,null,null,null,null,null,null,null,"pts",0,1,"","",0,null,"","","","","","","","","","","","","","","",""]
[{"$f":"'Week 1'!A77","v":"<Enter Participant 67>"},null,null,null,null,null,null,null,null,null,null,null,null,null,null,null,null,null,"pts",0,1,"","",0,null,"","","","","","","","","","","","","","","",""]
[{"$f":"'Week 1'!A78","v":"<Enter Participant 68>"},null,null,null,null,null,null,null,null,null,null,null,null,null,null,null,null,null,"pts",0,1,"","",0,null,{"$f":"IF(ISBLANK(B$6),\"\",IF(B78=B$6,1,0))","v":""},"","","","","","","","","","","","","","",""]
[{"$f":"'Week 1'!A79","v":"<Enter Participant 69>"},null,null,null,null,null,null,null,null,null,null,null,null,null,null,null,null,null,"pts",0,1,"","",0,null,"","","","","","","","","","","","","","","",""]
[{"$f":"'Week 1'!A80","v":"<Enter Participant 70>"},null,null,null,null,null,null,null,null,null,null,null,null,null,null,null,null,null,"pts",0,1,"","",0,null,"","","","","","","","","","","","","","","",""]
[{"$f":"'Week 1'!A81","v":"<Enter Participant 71>"},null,null,null,null,null,null,null,null,null,null,null,null,null,null,null,null,null,"pts",0,1,"","",0,null,"","","","","","","","","","","","","","","",""]
[{"$f":"'Week 1'!A82","v":"<Enter Participant 72>"},null,null,null,null,null,null,null,null,null,null,null,null,null,null,null,null,null,"pts",0,1,"","",0,null,"","","","","","","","","","","","","","","",""]
[{"$f":"'Week 1'!A83","v":"<Enter Participant 73>"},null,null,null,null,null,null,null,null,null,null,null,null,null,null,null,null,null,"pts",0,1,"","",0,null,"","","","","","","","","","","","","","","",""]
[{"$f":"'Week 1'!A84","v":"<Enter Participant 74>"},null,null,null,null,null,null,null,null,null,null,null,null,null,null,null,null,null,"pts",0,1,"","",0,null,"","","","","","","","","","","","","","","",""]
[{"$f":"'Week 1'!A85","v":"<Enter Participant 75>"},null,null,null,null,null,null,null,null,null,null,null,null,null,null,null,null,null,"pts",0,1,"","",0,null,"","","","","","","","","","","","","","","",""]
[{"$f":"'Week 1'!A86","v":"<Enter Participant 76>"},null,null,null,null,null,null,null,null,null,null,null,null,null,null,null,null,null,"pts",0,1,"","",0,null,"","","","","","","","","","","","","","","",""]
[{"$f":"'Week 1'!A87","v":"<Enter Participant 77>"},null,null,null,null,null,null,null,null,null,null,null,null,null,null,null,null,null,"pts",0,1,"","",0,null,"","","","","","","","","","","","","","","",""]
[{"$f":"'Week 1'!A88","v":"<Enter Participant 78>"},null,null,null,null,null,null,null,null,null,null,null,null,null,null,null,null,null,"pts",0,1,"","",0,null,"","","","","","","","","","","","","","","",""]
[{"$f":"'Week 1'!A89","v":"<Enter Participant 79>"},null,null,null,null,null,null,null,null,null,null,null,null,null,null,null,null,null,"pts",0,1,"","",0,null,"","","","","","","","","","","","","","","",""]
[{"$f":"'Week 1'!A90","v":"<Enter Participant 80>"},null,null,null,null,null,null,null,null,null,null,null,null,null,null,null,null,null,"pts",0,1,"","",0,null,"","","","","","","","","","","","","","","",""]
[{"$f":"'Week 1'!A91","v":"<Enter Participant 81>"},null,null,null,null,null,null,null,null,null,null,null,null,null,null,null,null,null,"pts",0,1,"","",0,null,"","","","","","","","","","","","","","","",""]
[{"$f":"'Week 1'!A92","v":"<Enter Participant 82>"},null,null,null,null,null,null,null,null,null,null,null,null,null,null,null,null,null,"pts",0,1,"","",0,null,"","","","","","","","","","","","","","","",""]
[{"$f":"'Week 1'!A93","v":"<Enter Participant 83>"},null,null,null,null,null,null,null,null,null,null,null,null,null,null,null,null,null,"pts",0,1,"","",0,null,"","","","","","","","","","","","","","","",""]
[{"$f":"'Week 1'!A94","v":"<Enter Participant 84>"},null,null,null,null,null,null,null,null,null,null,null,null,null,null,null,null,null,"pts",0,1,"","",0,null,{"$f":"IF(ISBLANK(B$6),\"\",IF(B94=B$6,1,0))","v":""},"","","","","","","","","","","","","","",""]
[{"$f":"'Week 1'!A95","v":"<Enter Participant 85>"},null,null,null,null,null,null,null,null,null,null,null,null,null,null,null,null,null,"pts",0,1,"","",0,null,"","","","","","","","","","","","","","","",""]
[{"$f":"'Week 1'!A96","v":"<Enter Participant 86>"},null,null,null,null,null,null,null,null,null,null,null,null,null,null,null,null,null,"pts",0,1,"","",0,null,"","","","","","","","","","","","","","","",""]
[{"$f":"'Week 1'!A97","v":"<Enter Participant 87>"},null,null,null,null,null,null,null,null,null,null,null,null,null,null,null,null,null,"pts",0,1,"","",0,null,"","","","","","","","","","","","","","","",""]
[{"$f":"'Week 1'!A98","v":"<Enter Participant 88>"},null,null,null,null,null,null,null,null,null,null,null,null,null,null,null,null,null,"pts",0,1,"","",0,null,"","","","","","","","","","","","","","","",""]
[{"$f":"'Week 1'!A99","v":"<Enter Participant 89>"},null,null,null,null,null,null,null,null,null,null,null,null,null,null,null,null,null,"pts",0,1,"","",0,null,"","","","","","","","","","","","","","","",""]
[{"$f":"'Week 1'!A100","v":"<Enter Participant 90>"},null,null,null,null,null,null,null,null,null,null,null,null,null,null,null,null,null,"pts",0,1,"","",0,null,"","","","","","","","","","","","","","","",""]
[{"$f":"'Week 1'!A101","v":"<Enter Participant 91>"},null,null,null,null,null,null,null,null,null,null,null,null,null,null,null,null,null,"pts",0,1,"","",0,null,"","","","","","","","","","","","","","","",""]
[{"$f":"'Week 1'!A102","v":"<Enter Participant 92>"},null,null,null,null,null,null,null,null,null,null,null,null,null,null,null,null,null,"pts",0,1,"","",0,null,"","","","","","","","","","","","","","","",""]
[{"$f":"'Week 1'!A103","v":"<Enter Participant 93>"},null,null,null,null,null,null,null,null,null,null,null,null,null,null,null,null,null,"pts",0,1,"","",0,null,"","","","","","","","","","","","","","","",""]
[{"$f":"'Week 1'!A104","v":"<Enter Participant 94>"},null,null,null,null,null,null,null,null,null,null,null,null,null,null,null,null,null,"pts",0,1,"","",0,null,"","","","","","","","","","","","","","","",""]
[{"$f":"'Week 1'!A105","v":"<Enter Participant 95>"},null,null,null,null,null,null,null,null,null,null,null,null,null,null,null,null,null,"pts",0,1,"","",0,null,"","","","","","","","","","","","","","","",""]
[{"$f":"'Week 1'!A106","v":"<Enter Participant 96>"},null,null,null,null,null,null,null,null,null,null,null,null,null,null,null,null,null,"pts",0,1,"","",0,null,"","","","","","","","","","","","","","","",""]
[{"$f":"'Week 1'!A107","v":"<Enter Participant 97>"},null,null,null,null,null,null,null,null,null,null,null,null,null,null,null,null,null,"pts",{"$f":"IF(SUM(Z107:AO107)=0,0,SUM(Z107:AO107))","v":0},1,"","",0,null,"","","","","","","","","","","","","","","",""]
[{"$f":"'Week 1'!A108","v":"<Enter Participant 98>"},null,null,null,null,null,null,null,null,null,null,null,null,null,null,null,null,null,"pts",0,1,"","",0,null,"","","","","","","","","","","","","","","",""]
[{"$f":"'Week 1'!A109","v":"<Enter Participant 99>"},null,null,null,null,null,null,null,null,null,null,null,null,null,null,null,null,null,"pts",0,1,"","",0,null,"","","","","","","","","","","","","","","",{"$f":"IF(ISBLANK(Q$6),\"\",IF(Q109=Q$6,1,0))","v":""}]
[{"$f":"'Week 1'!A110","v":"<Enter Participant 100>"},null,null,null,null,null,null,null,null,null,null,null,null,null,null,null,null,null,"pts",0,1,"","",0,null,{"$f":"IF(ISBLANK(B$6),\"\",IF(B110=B$6,1,0))","v":""},"","","","","","","","","","","","","","",""]

{"sheet":"Week 7","index":6,"n_rows":110,"n_cols":41,"rows_kept":110,"cut":false,"hidden":false,"merged":[[1,17,1,18],[1,19,3,23],[4,23,9,23],[9,17,9,18]]}
["Week Lookup Column Offset",2,3,4,5,6,7,8,9,10,11,12,13,14,15,16,17,null,null,null,null,null,null,{"$f":"MID(T2,FIND(\" \",T2)+1,2)*1+18","v":25}]
[null,"GAME 1","GAME 2","GAME 3","GAME 4","GAME 5","GAME 6","GAME 7","GAME 8","GAME 9","GAME 10","GAME 11","GAME 12","GAME 13","GAME 14","GAME 15","GAME 16","SCORE",null,"Week 7"]
["VISITOR",{"$f":"IF(VLOOKUP($T$2&\" Visitors\",SCHEDULE_TABLE,B$1,FALSE)=0,\"\",VLOOKUP($T$2&\" Visitors\",SCHEDULE_TABLE,B$1,FALSE))","v":"NYJ"},"ATL","MIN","MIA","NO","CAR","CIN","CLE","SEA","TEN","KC","NYG","ARI","SF","HOU","",null,"pts"]
[null,"at","at","at","at","at","at","at","at","at","at","at","at","at","at","at","at"]
["HOME",{"$f":"IF(VLOOKUP($T$2&\" Homes\",SCHEDULE_TABLE,B$1,FALSE)=0,\"\",VLOOKUP($T$2&\" Homes\",SCHEDULE_TABLE,B$1,FALSE))","v":"NE"},"BAL","BUF","CHI","DET","GB","IND","JAX","STL","WAS","SD","DAL","OAK","DEN","PIT","",null,"pts",null,null,null,null,"TOTAL POINTS FOR YEAR"]
["WINNER",null,null,null,null,null,null,null,null,null,null,null,null,null,null,null,null,{"$f":"IF(R3+R5=0,\"\",R3+R5)","v":""},"pts"]
[null,{"$f":"B3","v":"NYJ"},"ATL","MIN","MIA","NO","CAR","CIN","CLE","SEA","TEN","KC","NYG","ARI","SF","HOU",""]
[null,{"$f":"B5","v":"NE"},"BAL","BUF","CHI","DET","GB","IND","JAX","STL","WAS","SD","DAL","OAK","DEN","PIT",""]
[]
["NAME","PICKS","PICKS","PICKS","PICKS","PICKS","PICKS","PICKS","PICKS","PICKS","PICKS","PICKS","PICKS","PICKS","PICKS","PICKS","PICKS","TIE-BREAK",null,"PICK PTS","PTS RANK","ABS DIFF","TIE-BREAK"]
[{"$f":"'Week 1'!A11","v":"<Enter Participant 1>"},null,null,null,null,null,null,null,null,null,null,null,null,null,null,null,null,null,"pts",{"$f":"IF(SUM(Z11:AO11)=0,0,SUM(Z11:AO11))","v":0},{"$f":"IF(ISERROR(RANK(T11,$T$11:$T$85)),\"\",RANK(T11,$T$11:$T$85))","v":1},{"$f":"IF(ISBLANK(R11),\"\",IF(U11=1,ABS(R11-R$6),\"\"))","v":""},{"$f":"IF(ISERROR(RANK(V11,$V$11:$V$85,1)),\"\",RANK(V11,$V$11:$V$85,1))","v":""},{"$f":"VLOOKUP(A11,CUMULATIVE_TABLE,X$1,FALSE)","v":0},null,{"$f":"IF(ISBLANK(B$6),\"\",IF(B11=B$6,1,0))","v":""},"","","","","","","","","","","","","","",""]
[{"$f":"'Week 1'!A12","v":"<Enter Participant 2>"},null,null,null,null,null,null,null,null,null,null,null,null,null,null,null,null,null,"pts",0,1,"","",0,null,"","","","","","","","","","","","","","","",""]
[{"$f":"'Week 1'!A13","v":"<Enter Participant 3>"},null,null,null,null,null,null,null,null,null,null,null,null,null,null,null,null,null,"pts",0,1,"","",0,null,"","","","","","","","","","","","","","","",""]
[{"$f":"'Week 1'!A14","v":"<Enter Participant 4>"},null,null,null,null,null,null,null,null,null,null,null,null,null,null,null,null,null,"pts",0,1,"","",0,null,"","","","","","","","","","","","","","","",""]
[{"$f":"'Week 1'!A15","v":"<Enter Participant 5>"},null,null,null,null,null,null,null,null,null,null,null,null,null,null,null,null,null,"pts",0,1,"","",0,null,"","","","","","","","","","","","","","","",""]
[{"$f":"'Week 1'!A16","v":"<Enter Participant 6>"},null,null,null,null,null,null,null,null,null,null,null,null,null,null,null,null,null,"pts",0,1,"","",0,null,"","","","","","","","","","","","","","","",""]
[{"$f":"'Week 1'!A17","v":"<Enter Participant 7>"},null,null,null,null,null,null,null,null,null,null,null,null,null,null,null,null,null,"pts",0,1,"","",0,null,"","","","","","","","","","","","","","","",""]
[{"$f":"'Week 1'!A18","v":"<Enter Participant 8>"},null,null,null,null,null,null,null,null,null,null,null,null,null,null,null,null,null,"pts",0,1,"","",0,null,"","","","","","","","","","","","","","","",""]
[{"$f":"'Week 1'!A19","v":"<Enter Participant 9>"},null,null,null,null,null,null,null,null,null,null,null,null,null,null,null,null,null,"pts",0,1,"","",0,null,"","","","","","","","","","","","","","","",""]
[{"$f":"'Week 1'!A20","v":"<Enter Participant 10>"},null,null,null,null,null,null,null,null,null,null,null,null,null,null,null,null,null,"pts",0,1,"","",0,null,"","","","","","","","","","","","","","","",""]
[{"$f":"'Week 1'!A21","v":"<Enter Participant 11>"},null,null,null,null,null,null,null,null,null,null,null,null,null,null,null,null,null,"pts",0,1,"","",0,null,"","","","","","","","","","","","","","","",""]
[{"$f":"'Week 1'!A22","v":"<Enter Participant 12>"},null,null,null,null,null,null,null,null,null,null,null,null,null,null,null,null,null,"pts",0,1,"","",0,null,"","","","","","","","","","","","","","","",""]
[{"$f":"'Week 1'!A23","v":"<Enter Participant 13>"},null,null,null,null,null,null,null,null,null,null,null,null,null,null,null,null,null,"pts",0,1,"","",0,null,"","","","","","","","","","","","","","","",""]
[{"$f":"'Week 1'!A24","v":"<Enter Participant 14>"},null,null,null,null,null,null,null,null,null,null,null,null,null,null,null,null,null,"pts",0,1,"","",0,null,"","","","","","","","","","","","","","","",""]
[{"$f":"'Week 1'!A25","v":"<Enter Participant 15>"},null,null,null,null,null,null,null,null,null,null,null,null,null,null,null,null,null,"pts",0,1,"","",0,null,"","","","","","","","","","","","","","","",""]
[{"$f":"'Week 1'!A26","v":"<Enter Participant 16>"},null,null,null,null,null,null,null,null,null,null,null,null,null,null,null,null,null,"pts",0,1,"","",0,null,"","","","","","","","","","","","","","","",{"$f":"IF(ISBLANK(Q$6),\"\",IF(Q26=Q$6,1,0))","v":""}]
[{"$f":"'Week 1'!A27","v":"<Enter Participant 17>"},null,null,null,null,null,null,null,null,null,null,null,null,null,null,null,null,null,"pts",0,1,"","",0,null,{"$f":"IF(ISBLANK(B$6),\"\",IF(B27=B$6,1,0))","v":""},"","","","","","","","","","","","","","",""]
[{"$f":"'Week 1'!A28","v":"<Enter Participant 18>"},null,null,null,null,null,null,null,null,null,null,null,null,null,null,null,null,null,"pts",0,1,"","",0,null,"","","","","","","","","","","","","","","",""]
[{"$f":"'Week 1'!A29","v":"<Enter Participant 19>"},null,null,null,null,null,null,null,null,null,null,null,null,null,null,null,null,null,"pts",0,1,"","",0,null,"","","","","","","","","","","","","","","",""]
[{"$f":"'Week 1'!A30","v":"<Enter Participant 20>"},null,null,null,null,null,null,null,null,null,null,null,null,null,null,null,null,null,"pts",0,1,"","",0,null,"","","","","","","","","","","","","","","",""]
[{"$f":"'Week 1'!A31","v":"<Enter Participant 21>"},null,null,null,null,null,null,null,null,null,null,null,null,null,null,null,null,null,"pts",0,1,"","",0,null,"","","","","","","","","","","","","","","",""]
[{"$f":"'Week 1'!A32","v":"<Enter Participant 22>"},null,null,null,null,null,null,null,null,null,null,null,null,null,null,null,null,null,"pts",0,1,"","",0,null,"","","","","","","","","","","","","","","",""]
[{"$f":"'Week 1'!A33","v":"<Enter Participant 23>"},null,null,null,null,null,null,null,null,null,null,null,null,null,null,null,null,null,"pts",0,1,"","",0,null,"","","","","","","","","","","","","","","",""]
[{"$f":"'Week 1'!A34","v":"<Enter Participant 24>"},null,null,null,null,null,null,null,null,null,null,null,null,null,null,null,null,null,"pts",0,1,"","",0,null,"","","","","","","","","","","","","","","",""]
[{"$f":"'Week 1'!A35","v":"<Enter Participant 25>"},null,null,null,null,null,null,null,null,null,null,null,null,null,null,null,null,null,"pts",0,1,"","",0,null,"","","","","","","","","","","","","","","",""]
[{"$f":"'Week 1'!A36","v":"<Enter Participant 26>"},null,null,null,null,null,null,null,null,null,null,null,null,null,null,null,null,null,"pts",0,1,"","",0,null,"","","","","","","","","","","","","","","",""]
[{"$f":"'Week 1'!A37","v":"<Enter Participant 27>"},null,null,null,null,null,null,null,null,null,null,null,null,null,null,null,null,null,"pts",0,1,"","",0,null,"","","","","","","","","","","","","","","",""]
[{"$f":"'Week 1'!A38","v":"<Enter Participant 28>"},null,null,null,null,null,null,null,null,null,null,null,null,null,null,null,null,null,"pts",0,1,"","",0,null,"","","","","","","","","","","","","","","",""]
[{"$f":"'Week 1'!A39","v":"<Enter Participant 29>"},null,null,null,null,null,null,null,null,null,null,null,null,null,null,null,null,null,"pts",0,1,"","",0,null,"","","","","","","","","","","","","","","",""]
[{"$f":"'Week 1'!A40","v":"<Enter Participant 30>"},null,null,null,null,null,null,null,null,null,null,null,null,null,null,null,null,null,"pts",0,1,"","",0,null,"","","","","","","","","","","","","","","",""]
[{"$f":"'Week 1'!A41","v":"<Enter Participant 31>"},null,null,null,null,null,null,null,null,null,null,null,null,null,null,null,null,null,"pts",0,1,"","",0,null,"","","","","","","","","","","","","","","",""]
[{"$f":"'Week 1'!A42","v":"<Enter Participant 32>"},null,null,null,null,null,null,null,null,null,null,null,null,null,null,null,null,null,"pts",0,1,"","",0,null,"","","","","","","","","","","","","","","",""]
[{"$f":"'Week 1'!A43","v":"<Enter Participant 33>"},null,null,null,null,null,null,null,null,null,null,null,null,null,null,null,null,null,"pts",{"$f":"IF(SUM(Z43:AO43)=0,0,SUM(Z43:AO43))","v":0},1,"","",{"$f":"VLOOKUP(A43,CUMULATIVE_TABLE,X$1,FALSE)","v":0},null,"","","","","","","","","","","","","","","",""]
[{"$f":"'Week 1'!A44","v":"<Enter Participant 34>"},null,null,null,null,null,null,null,null,null,null,null,null,null,null,null,null,null,"pts",0,1,"","",0,null,{"$f":"IF(ISBLANK(B$6),\"\",IF(B44=B$6,1,0))","v":""},"","","","","","","","","","","","","","",""]
[{"$f":"'Week 1'!A45","v":"<Enter Participant 35>"},null,null,null,null,null,null,null,null,null,null,null,null,null,null,null,null,null,"pts",0,1,"","",0,null,"","","","","","","","","","","","","","","",""]
[{"$f":"'Week 1'!A46","v":"<Enter Participant 36>"},null,null,null,null,null,null,null,null,null,null,null,null,null,null,null,null,null,"pts",0,1,"","",0,null,"","","","","","","","","","","","","","","",""]
[{"$f":"'Week 1'!A47","v":"<Enter Participant 37>"},null,null,null,null,null,null,null,null,null,null,null,null,null,null,null,null,null,"pts",0,1,"","",0,null,"","","","","","","","","","","","","","","",""]
[{"$f":"'Week 1'!A48","v":"<Enter Participant 38>"},null,null,null,null,null,null,null,null,null,null,null,null,null,null,null,null,null,"pts",0,1,"","",0,null,"","","","","","","","","","","","","","","",""]
[{"$f":"'Week 1'!A49","v":"<Enter Participant 39>"},null,null,null,null,null,null,null,null,null,null,null,null,null,null,null,null,null,"pts",0,1,"","",0,null,"","","","","","","","","","","","","","","",""]
[{"$f":"'Week 1'!A50","v":"<Enter Participant 40>"},null,null,null,null,null,null,null,null,null,null,null,null,null,null,null,null,null,"pts",0,1,"","",0,null,"","","","","","","","","","","","","","","",""]
[{"$f":"'Week 1'!A51","v":"<Enter Participant 41>"},null,null,null,null,null,null,null,null,null,null,null,null,null,null,null,null,null,"pts",0,1,"","",0,null,"","","","","","","","","","","","","","","",""]
[{"$f":"'Week 1'!A52","v":"<Enter Participant 42>"},null,null,null,null,null,null,null,null,null,null,null,null,null,null,null,null,null,"pts",0,1,"","",0,null,"","","","","","","","","","","","","","","",""]
[{"$f":"'Week 1'!A53","v":"<Enter Participant 43>"},null,null,null,null,null,null,null,null,null,null,null,null,null,null,null,null,null,"pts",0,1,"","",0,null,"","","","","","","","","","","","","","","",""]
[{"$f":"'Week 1'!A54","v":"<Enter Participant 44>"},null,null,null,null,null,null,null,null,null,null,null,null,null,null,null,null,null,"pts",0,1,"","",0,null,"","","","","","","","","","","","","","","",""]
[{"$f":"'Week 1'!A55","v":"<Enter Participant 45>"},null,null,null,null,null,null,null,null,null,null,null,null,null,null,null,null,null,"pts",0,1,"","",0,null,"","","","","","","","","","","","","","","",""]
[{"$f":"'Week 1'!A56","v":"<Enter Participant 46>"},null,null,null,null,null,null,null,null,null,null,null,null,null,null,null,null,null,"pts",0,1,"","",0,null,"","","","","","","","","","","","","","","",""]
[{"$f":"'Week 1'!A57","v":"<Enter Participant 47>"},null,null,null,null,null,null,null,null,null,null,null,null,null,null,null,null,null,"pts",0,1,"","",0,null,"","","","","","","","","","","","","","","",""]
[{"$f":"'Week 1'!A58","v":"<Enter Participant 48>"},null,null,null,null,null,null,null,null,null,null,null,null,null,null,null,null,null,"pts",0,1,"","",0,null,"","","","","","","","","","","","","","","",""]
[{"$f":"'Week 1'!A59","v":"<Enter Participant 49>"},null,null,null,null,null,null,null,null,null,null,null,null,null,null,null,null,null,"pts",0,1,"","",0,null,"","","","","","","","","","","","","","","",""]
[{"$f":"'Week 1'!A60","v":"<Enter Participant 50>"},null,null,null,null,null,null,null,null,null,null,null,null,null,null,null,null,null,"pts",0,1,"","",0,null,"","","","","","","","","","","","","","","",""]
[{"$f":"'Week 1'!A61","v":"<Enter Participant 51>"},null,null,null,null,null,null,null,null,null,null,null,null,null,null,null,null,null,"pts",0,1,"","",0,null,{"$f":"IF(ISBLANK(B$6),\"\",IF(B61=B$6,1,0))","v":""},"","","","","","","","","","","","","","",""]
[{"$f":"'Week 1'!A62","v":"<Enter Participant 52>"},null,null,null,null,null,null,null,null,null,null,null,null,null,null,null,null,null,"pts",0,1,"","",0,null,"","","","","","","","","","","","","","","",""]
[{"$f":"'Week 1'!A63","v":"<Enter Participant 53>"},null,null,null,null,null,null,null,null,null,null,null,null,null,null,null,null,null,"pts",0,1,"","",0,null,"","","","","","","","","","","","","","","",""]
[{"$f":"'Week 1'!A64","v":"<Enter Participant 54>"},null,null,null,null,null,null,null,null,null,null,null,null,null,null,null,null,null,"pts",0,1,"","",0,null,"","","","","","","","","","","","","","","",""]
[{"$f":"'Week 1'!A65","v":"<Enter Participant 55>"},null,null,null,null,null,null,null,null,null,null,null,null,null,null,null,null,null,"pts",0,1,"","",0,null,"","","","","","","","","","","","","","","",""]
[{"$f":"'Week 1'!A66","v":"<Enter Participant 56>"},null,null,null,null,null,null,null,null,null,null,null,null,null,null,null,null,null,"pts",0,1,"","",0,null,"","","","","","","","","","","","","","","",""]
[{"$f":"'Week 1'!A67","v":"<Enter Participant 57>"},null,null,null,null,null,null,null,null,null,null,null,null,null,null,null,null,null,"pts",0,1,"","",0,null,"","","","","","","","","","","","","","","",""]
[{"$f":"'Week 1'!A68","v":"<Enter Participant 58>"},null,null,null,null,null,null,null,null,null,null,null,null,null,null,null,null,null,"pts",0,1,"","",0,null,"","","","","","","","","","","","","","","",""]
[{"$f":"'Week 1'!A69","v":"<Enter Participant 59>"},null,null,null,null,null,null,null,null,null,null,null,null,null,null,null,null,null,"pts",0,1,"","",0,null,"","","","","","","","","","","","","","","",""]
[{"$f":"'Week 1'!A70","v":"<Enter Participant 60>"},null,null,null,null,null,null,null,null,null,null,null,null,null,null,null,null,null,"pts",0,1,"","",0,null,"","","","","","","","","","","","","","","",""]
[{"$f":"'Week 1'!A71","v":"<Enter Participant 61>"},null,null,null,null,null,null,null,null,null,null,null,null,null,null,null,null,null,"pts",0,1,"","",0,null,"","","","","","","","","","","","","","","",""]
[{"$f":"'Week 1'!A72","v":"<Enter Participant 62>"},null,null,null,null,null,null,null,null,null,null,null,null,null,null,null,null,null,"pts",0,1,"","",0,null,"","","","","","","","","","","","","","","",""]
[{"$f":"'Week 1'!A73","v":"<Enter Participant 63>"},null,null,null,null,null,null,null,null,null,null,null,null,null,null,null,null,null,"pts",0,1,"","",0,null,"","","","","","","","","","","","","","","",""]
[{"$f":"'Week 1'!A74","v":"<Enter Participant 64>"},null,null,null,null,null,null,null,null,null,null,null,null,null,null,null,null,null,"pts",0,1,"","",0,null,"","","","","","","","","","","","","","","",""]
[{"$f":"'Week 1'!A75","v":"<Enter Participant 65>"},null,null,null,null,null,null,null,null,null,null,null,null,null,null,null,null,null,"pts",0,{"$f":"IF(ISERROR(RANK(T75,$T$11:$T$85)),\"\",RANK(T75,$T$11:$T$85))","v":1},{"$f":"IF(ISBLANK(R75),\"\",IF(U75=1,ABS(R75-R$6),\"\"))","v":""},{"$f":"IF(ISERROR(RANK(V75,$V$11:$V$85,1)),\"\",RANK(V75,$V$11:$V$85,1))","v":""},{"$f":"VLOOKUP(A75,CUMULATIVE_TABLE,X$1,FALSE)","v":0},null,"","","","","","","","","","","","","","","",""]
[{"$f":"'Week 1'!A76","v":"<Enter Participant 66>"},null,null,null,null,null,null,null,null,null,null,null,null,null,null,null,null,null,"pts",0,1,"","",0,null,"","","","","","","","","","","","","","","",""]
[{"$f":"'Week 1'!A77","v":"<Enter Participant 67>"},null,null,null,null,null,null,null,null,null,null,null,null,null,null,null,null,null,"pts",0,1,"","",0,null,"","","","","","","","","","","","","","","",""]
[{"$f":"'Week 1'!A78","v":"<Enter Participant 68>"},null,null,null,null,null,null,null,null,null,null,null,null,null,null,null,null,null,"pts",0,1,"","",0,null,{"$f":"IF(ISBLANK(B$6),\"\",IF(B78=B$6,1,0))","v":""},"","","","","","","","","","","","","","",""]
[{"$f":"'Week 1'!A79","v":"<Enter Participant 69>"},null,null,null,null,null,null,null,null,null,null,null,null,null,null,null,null,null,"pts",0,1,"","",0,null,"","","","","","","","","","","","","","","",""]
[{"$f":"'Week 1'!A80","v":"<Enter Participant 70>"},null,null,null,null,null,null,null,null,null,null,null,null,null,null,null,null,null,"pts",0,1,"","",0,null,"","","","","","","","","","","","","","","",""]
[{"$f":"'Week 1'!A81","v":"<Enter Participant 71>"},null,null,null,null,null,null,null,null,null,null,null,null,null,null,null,null,null,"pts",0,1,"","",0,null,"","","","","","","","","","","","","","","",""]
[{"$f":"'Week 1'!A82","v":"<Enter Participant 72>"},null,null,null,null,null,null,null,null,null,null,null,null,null,null,null,null,null,"pts",0,1,"","",0,null,"","","","","","","","","","","","","","","",""]
[{"$f":"'Week 1'!A83","v":"<Enter Participant 73>"},null,null,null,null,null,null,null,null,null,null,null,null,null,null,null,null,null,"pts",0,1,"","",0,null,"","","","","","","","","","","","","","","",""]
[{"$f":"'Week 1'!A84","v":"<Enter Participant 74>"},null,null,null,null,null,null,null,null,null,null,null,null,null,null,null,null,null,"pts",0,1,"","",0,null,"","","","","","","","","","","","","","","",""]
[{"$f":"'Week 1'!A85","v":"<Enter Participant 75>"},null,null,null,null,null,null,null,null,null,null,null,null,null,null,null,null,null,"pts",0,1,"","",0,null,"","","","","","","","","","","","","","","",""]
[{"$f":"'Week 1'!A86","v":"<Enter Participant 76>"},null,null,null,null,null,null,null,null,null,null,null,null,null,null,null,null,null,"pts",0,1,"","",0,null,"","","","","","","","","","","","","","","",""]
[{"$f":"'Week 1'!A87","v":"<Enter Participant 77>"},null,null,null,null,null,null,null,null,null,null,null,null,null,null,null,null,null,"pts",0,1,"","",0,null,"","","","","","","","","","","","","","","",""]
[{"$f":"'Week 1'!A88","v":"<Enter Participant 78>"},null,null,null,null,null,null,null,null,null,null,null,null,null,null,null,null,null,"pts",0,1,"","",0,null,"","","","","","","","","","","","","","","",""]
[{"$f":"'Week 1'!A89","v":"<Enter Participant 79>"},null,null,null,null,null,null,null,null,null,null,null,null,null,null,null,null,null,"pts",0,1,"","",0,null,"","","","","","","","","","","","","","","",""]
[{"$f":"'Week 1'!A90","v":"<Enter Participant 80>"},null,null,null,null,null,null,null,null,null,null,null,null,null,null,null,null,null,"pts",0,1,"","",0,null,"","","","","","","","","","","","","","","",""]
[{"$f":"'Week 1'!A91","v":"<Enter Participant 81>"},null,null,null,null,null,null,null,null,null,null,null,null,null,null,null,null,null,"pts",0,1,"","",0,null,"","","","","","","","","","","","","","","",""]
[{"$f":"'Week 1'!A92","v":"<Enter Participant 82>"},null,null,null,null,null,null,null,null,null,null,null,null,null,null,null,null,null,"pts",0,1,"","",0,null,"","","","","","","","","","","","","","","",""]
[{"$f":"'Week 1'!A93","v":"<Enter Participant 83>"},null,null,null,null,null,null,null,null,null,null,null,null,null,null,null,null,null,"pts",0,1,"","",0,null,"","","","","","","","","","","","","","","",""]
[{"$f":"'Week 1'!A94","v":"<Enter Participant 84>"},null,null,null,null,null,null,null,null,null,null,null,null,null,null,null,null,null,"pts",0,1,"","",0,null,{"$f":"IF(ISBLANK(B$6),\"\",IF(B94=B$6,1,0))","v":""},"","","","","","","","","","","","","","",""]
[{"$f":"'Week 1'!A95","v":"<Enter Participant 85>"},null,null,null,null,null,null,null,null,null,null,null,null,null,null,null,null,null,"pts",0,1,"","",0,null,"","","","","","","","","","","","","","","",""]
[{"$f":"'Week 1'!A96","v":"<Enter Participant 86>"},null,null,null,null,null,null,null,null,null,null,null,null,null,null,null,null,null,"pts",0,1,"","",0,null,"","","","","","","","","","","","","","","",""]
[{"$f":"'Week 1'!A97","v":"<Enter Participant 87>"},null,null,null,null,null,null,null,null,null,null,null,null,null,null,null,null,null,"pts",0,1,"","",0,null,"","","","","","","","","","","","","","","",""]
[{"$f":"'Week 1'!A98","v":"<Enter Participant 88>"},null,null,null,null,null,null,null,null,null,null,null,null,null,null,null,null,null,"pts",0,1,"","",0,null,"","","","","","","","","","","","","","","",""]
[{"$f":"'Week 1'!A99","v":"<Enter Participant 89>"},null,null,null,null,null,null,null,null,null,null,null,null,null,null,null,null,null,"pts",0,1,"","",0,null,"","","","","","","","","","","","","","","",""]
[{"$f":"'Week 1'!A100","v":"<Enter Participant 90>"},null,null,null,null,null,null,null,null,null,null,null,null,null,null,null,null,null,"pts",0,1,"","",0,null,"","","","","","","","","","","","","","","",""]
[{"$f":"'Week 1'!A101","v":"<Enter Participant 91>"},null,null,null,null,null,null,null,null,null,null,null,null,null,null,null,null,null,"pts",0,1,"","",0,null,"","","","","","","","","","","","","","","",""]
[{"$f":"'Week 1'!A102","v":"<Enter Participant 92>"},null,null,null,null,null,null,null,null,null,null,null,null,null,null,null,null,null,"pts",0,1,"","",0,null,"","","","","","","","","","","","","","","",""]
[{"$f":"'Week 1'!A103","v":"<Enter Participant 93>"},null,null,null,null,null,null,null,null,null,null,null,null,null,null,null,null,null,"pts",0,1,"","",0,null,"","","","","","","","","","","","","","","",""]
[{"$f":"'Week 1'!A104","v":"<Enter Participant 94>"},null,null,null,null,null,null,null,null,null,null,null,null,null,null,null,null,null,"pts",0,1,"","",0,null,"","","","","","","","","","","","","","","",""]
[{"$f":"'Week 1'!A105","v":"<Enter Participant 95>"},null,null,null,null,null,null,null,null,null,null,null,null,null,null,null,null,null,"pts",0,1,"","",0,null,"","","","","","","","","","","","","","","",""]
[{"$f":"'Week 1'!A106","v":"<Enter Participant 96>"},null,null,null,null,null,null,null,null,null,null,null,null,null,null,null,null,null,"pts",0,1,"","",0,null,"","","","","","","","","","","","","","","",""]
[{"$f":"'Week 1'!A107","v":"<Enter Participant 97>"},null,null,null,null,null,null,null,null,null,null,null,null,null,null,null,null,null,"pts",{"$f":"IF(SUM(Z107:AO107)=0,0,SUM(Z107:AO107))","v":0},1,"","",0,null,"","","","","","","","","","","","","","","",""]
[{"$f":"'Week 1'!A108","v":"<Enter Participant 98>"},null,null,null,null,null,null,null,null,null,null,null,null,null,null,null,null,null,"pts",0,1,"","",0,null,"","","","","","","","","","","","","","","",""]
[{"$f":"'Week 1'!A109","v":"<Enter Participant 99>"},null,null,null,null,null,null,null,null,null,null,null,null,null,null,null,null,null,"pts",0,1,"","",0,null,"","","","","","","","","","","","","","","",{"$f":"IF(ISBLANK(Q$6),\"\",IF(Q109=Q$6,1,0))","v":""}]
[{"$f":"'Week 1'!A110","v":"<Enter Participant 100>"},null,null,null,null,null,null,null,null,null,null,null,null,null,null,null,null,null,"pts",0,1,"","",0,null,{"$f":"IF(ISBLANK(B$6),\"\",IF(B110=B$6,1,0))","v":""},"","","","","","","","","","","","","","",""]

{"sheet":"Week 8","index":7,"n_rows":110,"n_cols":41,"rows_kept":110,"cut":false,"hidden":false,"merged":[[1,17,1,18],[1,19,3,23],[4,23,9,23],[9,17,9,18]]}
["Week Lookup Column Offset",2,3,4,5,6,7,8,9,10,11,12,13,14,15,16,17,null,null,null,null,null,null,{"$f":"MID(T2,FIND(\" \",T2)+1,2)*1+18","v":26}]
[null,"GAME 1","GAME 2","GAME 3","GAME 4","GAME 5","GAME 6","GAME 7","GAME 8","GAME 9","GAME 10","GAME 11","GAME 12","GAME 13","GAME 14","GAME 15","GAME 16","SCORE",null,"Week 8"]
["VISITOR",{"$f":"IF(VLOOKUP($T$2&\" Visitors\",SCHEDULE_TABLE,B$1,FALSE)=0,\"\",VLOOKUP($T$2&\" Visitors\",SCHEDULE_TABLE,B$1,FALSE))","v":"SD"},"DET","SEA","BAL","MIA","STL","CHI","BUF","MIN","HOU","PHI","OAK","IND","GB","WAS","",null,"pts"]
[null,"at","at","at","at","at","at","at","at","at","at","at","at","at","at","at","at"]
["HOME",{"$f":"IF(VLOOKUP($T$2&\" Homes\",SCHEDULE_TABLE,B$1,FALSE)=0,\"\",VLOOKUP($T$2&\" Homes\",SCHEDULE_TABLE,B$1,FALSE))","v":"DEN"},"ATL","CAR","CIN","JAX","KC","NE","NYJ","TB","TEN","ARI","CLE","PIT","NO","DAL","",null,"pts",null,null,null,null,"TOTAL POINTS FOR YEAR"]
["WINNER",null,null,null,null,null,null,null,null,null,null,null,null,null,null,null,null,{"$f":"IF(R3+R5=0,\"\",R3+R5)","v":""},"pts"]
[null,{"$f":"B3","v":"SD"},"DET","SEA","BAL","MIA","STL","CHI","BUF","MIN","HOU","PHI","OAK","IND","GB","WAS",""]
[null,{"$f":"B5","v":"DEN"},"ATL","CAR","CIN","JAX","KC","NE","NYJ","TB","TEN","ARI","CLE","PIT","NO","DAL",""]
[]
["NAME","PICKS","PICKS","PICKS","PICKS","PICKS","PICKS","PICKS","PICKS","PICKS","PICKS","PICKS","PICKS","PICKS","PICKS","PICKS","PICKS","TIE-BREAK",null,"PICK PTS","PTS RANK","ABS DIFF","TIE-BREAK"]
[{"$f":"'Week 1'!A11","v":"<Enter Participant 1>"},null,null,null,null,null,null,null,null,null,null,null,null,null,null,null,null,null,"pts",{"$f":"IF(SUM(Z11:AO11)=0,0,SUM(Z11:AO11))","v":0},{"$f":"IF(ISERROR(RANK(T11,$T$11:$T$85)),\"\",RANK(T11,$T$11:$T$85))","v":1},{"$f":"IF(ISBLANK(R11),\"\",IF(U11=1,ABS(R11-R$6),\"\"))","v":""},{"$f":"IF(ISERROR(RANK(V11,$V$11:$V$85,1)),\"\",RANK(V11,$V$11:$V$85,1))","v":""},{"$f":"VLOOKUP(A11,CUMULATIVE_TABLE,X$1,FALSE)","v":0},null,{"$f":"IF(ISBLANK(B$6),\"\",IF(B11=B$6,1,0))","v":""},"","","","","","","","","","","","","","",""]
[{"$f":"'Week 1'!A12","v":"<Enter Participant 2>"},null,null,null,null,null,null,null,null,null,null,null,null,null,null,null,null,null,"pts",0,1,"","",0,null,"","","","","","","","","","","","","","","",""]
[{"$f":"'Week 1'!A13","v":"<Enter Participant 3>"},null,null,null,null,null,null,null,null,null,null,null,null,null,null,null,null,null,"pts",0,1,"","",0,null,"","","","","","","","","","","","","","","",""]
[{"$f":"'Week 1'!A14","v":"<Enter Participant 4>"},null,null,null,null,null,null,null,null,null,null,null,null,null,null,null,null,null,"pts",0,1,"","",0,null,"","","","","","","","","","","","","","","",""]
[{"$f":"'Week 1'!A15","v":"<Enter Participant 5>"},null,null,null,null,null,null,null,null,null,null,null,null,null,null,null,null,null,"pts",0,1,"","",0,null,"","","","","","","","","","","","","","","",""]
[{"$f":"'Week 1'!A16","v":"<Enter Participant 6>"},null,null,null,null,null,null,null,null,null,null,null,null,null,null,null,null,null,"pts",0,1,"","",0,null,"","","","","","","","","","","","","","","",""]
[{"$f":"'Week 1'!A17","v":"<Enter Participant 7>"},null,null,null,null,null,null,null,null,null,null,null,null,null,null,null,null,null,"pts",0,1,"","",0,null,"","","","","","","","","","","","","","","",""]
[{"$f":"'Week 1'!A18","v":"<Enter Participant 8>"},null,null,null,null,null,null,null,null,null,null,null,null,null,null,null,null,null,"pts",0,1,"","",0,null,"","","","","","","","","","","","","","","",""]
[{"$f":"'Week 1'!A19","v":"<Enter Participant 9>"},null,null,null,null,null,null,null,null,null,null,null,null,null,null,null,null,null,"pts",0,1,"","",0,null,"","","","","","","","","","","","","","","",""]
[{"$f":"'Week 1'!A20","v":"<Enter Participant 10>"},null,null,null,null,null,null,null,null,null,null,null,null,null,null,null,null,null,"pts",0,1,"","",0,null,"","","","","","","","","","","","","","","",""]
[{"$f":"'Week 1'!A21","v":"<Enter Participant 11>"},null,null,null,null,null,null,null,null,null,null,null,null,null,null,null,null,null,"pts",0,1,"","",0,null,"","","","","","","","","","","","","","","",""]
[{"$f":"'Week 1'!A22","v":"<Enter Participant 12>"},null,null,null,null,null,null,null,null,null,null,null,null,null,null,null,null,null,"pts",0,1,"","",0,null,"","","","","","","","","","","","","","","",""]
[{"$f":"'Week 1'!A23","v":"<Enter Participant 13>"},null,null,null,null,null,null,null,null,null,null,null,null,null,null,null,null,null,"pts",0,1,"","",0,null,"","","","","","","","","","","","","","","",""]
[{"$f":"'Week 1'!A24","v":"<Enter Participant 14>"},null,null,null,null,null,null,null,null,null,null,null,null,null,null,null,null,null,"pts",0,1,"","",0,null,"","","","","","","","","","","","","","","",""]
[{"$f":"'Week 1'!A25","v":"<Enter Participant 15>"},null,null,null,null,null,null,null,null,null,null,null,null,null,null,null,null,null,"pts",0,1,"","",0,null,"","","","","","","","","","","","","","","",""]
[{"$f":"'Week 1'!A26","v":"<Enter Participant 16>"},null,null,null,null,null,null,null,null,null,null,null,null,null,null,null,null,null,"pts",0,1,"","",0,null,"","","","","","","","","","","","","","","",{"$f":"IF(ISBLANK(Q$6),\"\",IF(Q26=Q$6,1,0))","v":""}]
[{"$f":"'Week 1'!A27","v":"<Enter Participant 17>"},null,null,null,null,null,null,null,null,null,null,null,null,null,null,null,null,null,"pts",0,1,"","",0,null,{"$f":"IF(ISBLANK(B$6),\"\",IF(B27=B$6,1,0))","v":""},"","","","","","","","","","","","","","",""]
[{"$f":"'Week 1'!A28","v":"<Enter Participant 18>"},null,null,null,null,null,null,null,null,null,null,null,null,null,null,null,null,null,"pts",0,1,"","",0,null,"","","","","","","","","","","","","","","",""]
[{"$f":"'Week 1'!A29","v":"<Enter Participant 19>"},null,null,null,null,null,null,null,null,null,null,null,null,null,null,null,null,null,"pts",0,1,"","",0,null,"","","","","","","","","","","","","","","",""]
[{"$f":"'Week 1'!A30","v":"<Enter Participant 20>"},null,null,null,null,null,null,null,null,null,null,null,null,null,null,null,null,null,"pts",0,1,"","",0,null,"","","","","","","","","","","","","","","",""]
[{"$f":"'Week 1'!A31","v":"<Enter Participant 21>"},null,null,null,null,null,null,null,null,null,null,null,null,null,null,null,null,null,"pts",0,1,"","",0,null,"","","","","","","","","","","","","","","",""]
[{"$f":"'Week 1'!A32","v":"<Enter Participant 22>"},null,null,null,null,null,null,null,null,null,null,null,null,null,null,null,null,null,"pts",0,1,"","",0,null,"","","","","","","","","","","","","","","",""]
[{"$f":"'Week 1'!A33","v":"<Enter Participant 23>"},null,null,null,null,null,null,null,null,null,null,null,null,null,null,null,null,null,"pts",0,1,"","",0,null,"","","","","","","","","","","","","","","",""]
[{"$f":"'Week 1'!A34","v":"<Enter Participant 24>"},null,null,null,null,null,null,null,null,null,null,null,null,null,null,null,null,null,"pts",0,1,"","",0,null,"","","","","","","","","","","","","","","",""]
[{"$f":"'Week 1'!A35","v":"<Enter Participant 25>"},null,null,null,null,null,null,null,null,null,null,null,null,null,null,null,null,null,"pts",0,1,"","",0,null,"","","","","","","","","","","","","","","",""]
[{"$f":"'Week 1'!A36","v":"<Enter Participant 26>"},null,null,null,null,null,null,null,null,null,null,null,null,null,null,null,null,null,"pts",0,1,"","",0,null,"","","","","","","","","","","","","","","",""]
[{"$f":"'Week 1'!A37","v":"<Enter Participant 27>"},null,null,null,null,null,null,null,null,null,null,null,null,null,null,null,null,null,"pts",0,1,"","",0,null,"","","","","","","","","","","","","","","",""]
[{"$f":"'Week 1'!A38","v":"<Enter Participant 28>"},null,null,null,null,null,null,null,null,null,null,null,null,null,null,null,null,null,"pts",0,1,"","",0,null,"","","","","","","","","","","","","","","",""]
[{"$f":"'Week 1'!A39","v":"<Enter Participant 29>"},null,null,null,null,null,null,null,null,null,null,null,null,null,null,null,null,null,"pts",0,1,"","",0,null,"","","","","","","","","","","","","","","",""]
[{"$f":"'Week 1'!A40","v":"<Enter Participant 30>"},null,null,null,null,null,null,null,null,null,null,null,null,null,null,null,null,null,"pts",0,1,"","",0,null,"","","","","","","","","","","","","","","",""]
[{"$f":"'Week 1'!A41","v":"<Enter Participant 31>"},null,null,null,null,null,null,null,null,null,null,null,null,null,null,null,null,null,"pts",0,1,"","",0,null,"","","","","","","","","","","","","","","",""]
[{"$f":"'Week 1'!A42","v":"<Enter Participant 32>"},null,null,null,null,null,null,null,null,null,null,null,null,null,null,null,null,null,"pts",0,1,"","",0,null,"","","","","","","","","","","","","","","",""]
[{"$f":"'Week 1'!A43","v":"<Enter Participant 33>"},null,null,null,null,null,null,null,null,null,null,null,null,null,null,null,null,null,"pts",{"$f":"IF(SUM(Z43:AO43)=0,0,SUM(Z43:AO43))","v":0},1,"","",{"$f":"VLOOKUP(A43,CUMULATIVE_TABLE,X$1,FALSE)","v":0},null,"","","","","","","","","","","","","","","",""]
[{"$f":"'Week 1'!A44","v":"<Enter Participant 34>"},null,null,null,null,null,null,null,null,null,null,null,null,null,null,null,null,null,"pts",0,1,"","",0,null,{"$f":"IF(ISBLANK(B$6),\"\",IF(B44=B$6,1,0))","v":""},"","","","","","","","","","","","","","",""]
[{"$f":"'Week 1'!A45","v":"<Enter Participant 35>"},null,null,null,null,null,null,null,null,null,null,null,null,null,null,null,null,null,"pts",0,1,"","",0,null,"","","","","","","","","","","","","","","",""]
[{"$f":"'Week 1'!A46","v":"<Enter Participant 36>"},null,null,null,null,null,null,null,null,null,null,null,null,null,null,null,null,null,"pts",0,1,"","",0,null,"","","","","","","","","","","","","","","",""]
[{"$f":"'Week 1'!A47","v":"<Enter Participant 37>"},null,null,null,null,null,null,null,null,null,null,null,null,null,null,null,null,null,"pts",0,1,"","",0,null,"","","","","","","","","","","","","","","",""]
[{"$f":"'Week 1'!A48","v":"<Enter Participant 38>"},null,null,null,null,null,null,null,null,null,null,null,null,null,null,null,null,null,"pts",0,1,"","",0,null,"","","","","","","","","","","","","","","",""]
[{"$f":"'Week 1'!A49","v":"<Enter Participant 39>"},null,null,null,null,null,null,null,null,null,null,null,null,null,null,null,null,null,"pts",0,1,"","",0,null,"","","","","","","","","","","","","","","",""]
[{"$f":"'Week 1'!A50","v":"<Enter Participant 40>"},null,null,null,null,null,null,null,null,null,null,null,null,null,null,null,null,null,"pts",0,1,"","",0,null,"","","","","","","","","","","","","","","",""]
[{"$f":"'Week 1'!A51","v":"<Enter Participant 41>"},null,null,null,null,null,null,null,null,null,null,null,null,null,null,null,null,null,"pts",0,1,"","",0,null,"","","","","","","","","","","","","","","",""]
[{"$f":"'Week 1'!A52","v":"<Enter Participant 42>"},null,null,null,null,null,null,null,null,null,null,null,null,null,null,null,null,null,"pts",0,1,"","",0,null,"","","","","","","","","","","","","","","",""]
[{"$f":"'Week 1'!A53","v":"<Enter Participant 43>"},null,null,null,null,null,null,null,null,null,null,null,null,null,null,null,null,null,"pts",0,1,"","",0,null,"","","","","","","","","","","","","","","",""]
[{"$f":"'Week 1'!A54","v":"<Enter Participant 44>"},null,null,null,null,null,null,null,null,null,null,null,null,null,null,null,null,null,"pts",0,1,"","",0,null,"","","","","","","","","","","","","","","",""]
[{"$f":"'Week 1'!A55","v":"<Enter Participant 45>"},null,null,null,null,null,null,null,null,null,null,null,null,null,null,null,null,null,"pts",0,1,"","",0,null,"","","","","","","","","","","","","","","",""]
[{"$f":"'Week 1'!A56","v":"<Enter Participant 46>"},null,null,null,null,null,null,null,null,null,null,null,null,null,null,null,null,null,"pts",0,1,"","",0,null,"","","","","","","","","","","","","","","",""]
[{"$f":"'Week 1'!A57","v":"<Enter Participant 47>"},null,null,null,null,null,null,null,null,null,null,null,null,null,null,null,null,null,"pts",0,1,"","",0,null,"","","","","","","","","","","","","","","",""]
[{"$f":"'Week 1'!A58","v":"<Enter Participant 48>"},null,null,null,null,null,null,null,null,null,null,null,null,null,null,null,null,null,"pts",0,1,"","",0,null,"","","","","","","","","","","","","","","",""]
[{"$f":"'Week 1'!A59","v":"<Enter Participant 49>"},null,null,null,null,null,null,null,null,null,null,null,null,null,null,null,null,null,"pts",0,1,"","",0,null,"","","","","","","","","","","","","","","",""]
[{"$f":"'Week 1'!A60","v":"<Enter Participant 50>"},null,null,null,null,null,null,null,null,null,null,null,null,null,null,null,null,null,"pts",0,1,"","",0,null,"","","","","","","","","","","","","","","",""]
[{"$f":"'Week 1'!A61","v":"<Enter Participant 51>"},null,null,null,null,null,null,null,null,null,null,null,null,null,null,null,null,null,"pts",0,1,"","",0,null,{"$f":"IF(ISBLANK(B$6),\"\",IF(B61=B$6,1,0))","v":""},"","","","","","","","","","","","","","",""]
[{"$f":"'Week 1'!A62","v":"<Enter Participant 52>"},null,null,null,null,null,null,null,null,null,null,null,null,null,null,null,null,null,"pts",0,1,"","",0,null,"","","","","","","","","","","","","","","",""]
[{"$f":"'Week 1'!A63","v":"<Enter Participant 53>"},null,null,null,null,null,null,null,null,null,null,null,null,null,null,null,null,null,"pts",0,1,"","",0,null,"","","","","","","","","","","","","","","",""]
[{"$f":"'Week 1'!A64","v":"<Enter Participant 54>"},null,null,null,null,null,null,null,null,null,null,null,null,null,null,null,null,null,"pts",0,1,"","",0,null,"","","","","","","","","","","","","","","",""]
[{"$f":"'Week 1'!A65","v":"<Enter Participant 55>"},null,null,null,null,null,null,null,null,null,null,null,null,null,null,null,null,null,"pts",0,1,"","",0,null,"","","","","","","","","","","","","","","",""]
[{"$f":"'Week 1'!A66","v":"<Enter Participant 56>"},null,null,null,null,null,null,null,null,null,null,null,null,null,null,null,null,null,"pts",0,1,"","",0,null,"","","","","","","","","","","","","","","",""]
[{"$f":"'Week 1'!A67","v":"<Enter Participant 57>"},null,null,null,null,null,null,null,null,null,null,null,null,null,null,null,null,null,"pts",0,1,"","",0,null,"","","","","","","","","","","","","","","",""]
[{"$f":"'Week 1'!A68","v":"<Enter Participant 58>"},null,null,null,null,null,null,null,null,null,null,null,null,null,null,null,null,null,"pts",0,1,"","",0,null,"","","","","","","","","","","","","","","",""]
[{"$f":"'Week 1'!A69","v":"<Enter Participant 59>"},null,null,null,null,null,null,null,null,null,null,null,null,null,null,null,null,null,"pts",0,1,"","",0,null,"","","","","","","","","","","","","","","",""]
[{"$f":"'Week 1'!A70","v":"<Enter Participant 60>"},null,null,null,null,null,null,null,null,null,null,null,null,null,null,null,null,null,"pts",0,1,"","",0,null,"","","","","","","","","","","","","","","",""]
[{"$f":"'Week 1'!A71","v":"<Enter Participant 61>"},null,null,null,null,null,null,null,null,null,null,null,null,null,null,null,null,null,"pts",0,1,"","",0,null,"","","","","","","","","","","","","","","",""]
[{"$f":"'Week 1'!A72","v":"<Enter Participant 62>"},null,null,null,null,null,null,null,null,null,null,null,null,null,null,null,null,null,"pts",0,1,"","",0,null,"","","","","","","","","","","","","","","",""]
[{"$f":"'Week 1'!A73","v":"<Enter Participant 63>"},null,null,null,null,null,null,null,null,null,null,null,null,null,null,null,null,null,"pts",0,1,"","",0,null,"","","","","","","","","","","","","","","",""]
[{"$f":"'Week 1'!A74","v":"<Enter Participant 64>"},null,null,null,null,null,null,null,null,null,null,null,null,null,null,null,null,null,"pts",0,1,"","",0,null,"","","","","","","","","","","","","","","",""]
[{"$f":"'Week 1'!A75","v":"<Enter Participant 65>"},null,null,null,null,null,null,null,null,null,null,null,null,null,null,null,null,null,"pts",0,{"$f":"IF(ISERROR(RANK(T75,$T$11:$T$85)),\"\",RANK(T75,$T$11:$T$85))","v":1},{"$f":"IF(ISBLANK(R75),\"\",IF(U75=1,ABS(R75-R$6),\"\"))","v":""},{"$f":"IF(ISERROR(RANK(V75,$V$11:$V$85,1)),\"\",RANK(V75,$V$11:$V$85,1))","v":""},{"$f":"VLOOKUP(A75,CUMULATIVE_TABLE,X$1,FALSE)","v":0},null,"","","","","","","","","","","","","","","",""]
[{"$f":"'Week 1'!A76","v":"<Enter Participant 66>"},null,null,null,null,null,null,null,null,null,null,null,null,null,null,null,null,null,"pts",0,1,"","",0,null,"","","","","","","","","","","","","","","",""]
[{"$f":"'Week 1'!A77","v":"<Enter Participant 67>"},null,null,null,null,null,null,null,null,null,null,null,null,null,null,null,null,null,"pts",0,1,"","",0,null,"","","","","","","","","","","","","","","",""]
[{"$f":"'Week 1'!A78","v":"<Enter Participant 68>"},null,null,null,null,null,null,null,null,null,null,null,null,null,null,null,null,null,"pts",0,1,"","",0,null,{"$f":"IF(ISBLANK(B$6),\"\",IF(B78=B$6,1,0))","v":""},"","","","","","","","","","","","","","",""]
[{"$f":"'Week 1'!A79","v":"<Enter Participant 69>"},null,null,null,null,null,null,null,null,null,null,null,null,null,null,null,null,null,"pts",0,1,"","",0,null,"","","","","","","","","","","","","","","",""]
[{"$f":"'Week 1'!A80","v":"<Enter Participant 70>"},null,null,null,null,null,null,null,null,null,null,null,null,null,null,null,null,null,"pts",0,1,"","",0,null,"","","","","","","","","","","","","","","",""]
[{"$f":"'Week 1'!A81","v":"<Enter Participant 71>"},null,null,null,null,null,null,null,null,null,null,null,null,null,null,null,null,null,"pts",0,1,"","",0,null,"","","","","","","","","","","","","","","",""]
[{"$f":"'Week 1'!A82","v":"<Enter Participant 72>"},null,null,null,null,null,null,null,null,null,null,null,null,null,null,null,null,null,"pts",0,1,"","",0,null,"","","","","","","","","","","","","","","",""]
[{"$f":"'Week 1'!A83","v":"<Enter Participant 73>"},null,null,null,null,null,null,null,null,null,null,null,null,null,null,null,null,null,"pts",0,1,"","",0,null,"","","","","","","","","","","","","","","",""]
[{"$f":"'Week 1'!A84","v":"<Enter Participant 74>"},null,null,null,null,null,null,null,null,null,null,null,null,null,null,null,null,null,"pts",0,1,"","",0,null,"","","","","","","","","","","","","","","",""]
[{"$f":"'Week 1'!A85","v":"<Enter Participant 75>"},null,null,null,null,null,null,null,null,null,null,null,null,null,null,null,null,null,"pts",0,1,"","",0,null,"","","","","","","","","","","","","","","",""]
[{"$f":"'Week 1'!A86","v":"<Enter Participant 76>"},null,null,null,null,null,null,null,null,null,null,null,null,null,null,null,null,null,"pts",0,1,"","",0,null,"","","","","","","","","","","","","","","",""]
[{"$f":"'Week 1'!A87","v":"<Enter Participant 77>"},null,null,null,null,null,null,null,null,null,null,null,null,null,null,null,null,null,"pts",0,1,"","",0,null,"","","","","","","","","","","","","","","",""]
[{"$f":"'Week 1'!A88","v":"<Enter Participant 78>"},null,null,null,null,null,null,null,null,null,null,null,null,null,null,null,null,null,"pts",0,1,"","",0,null,"","","","","","","","","","","","","","","",""]
[{"$f":"'Week 1'!A89","v":"<Enter Participant 79>"},null,null,null,null,null,null,null,null,null,null,null,null,null,null,null,null,null,"pts",0,1,"","",0,null,"","","","","","","","","","","","","","","",""]
[{"$f":"'Week 1'!A90","v":"<Enter Participant 80>"},null,null,null,null,null,null,null,null,null,null,null,null,null,null,null,null,null,"pts",0,1,"","",0,null,"","","","","","","","","","","","","","","",""]
[{"$f":"'Week 1'!A91","v":"<Enter Participant 81>"},null,null,null,null,null,null,null,null,null,null,null,null,null,null,null,null,null,"pts",0,1,"","",0,null,"","","","","","","","","","","","","","","",""]
[{"$f":"'Week 1'!A92","v":"<Enter Participant 82>"},null,null,null,null,null,null,null,null,null,null,null,null,null,null,null,null,null,"pts",0,1,"","",0,null,"","","","","","","","","","","","","","","",""]
[{"$f":"'Week 1'!A93","v":"<Enter Participant 83>"},null,null,null,null,null,null,null,null,null,null,null,null,null,null,null,null,null,"pts",0,1,"","",0,null,"","","","","","","","","","","","","","","",""]
[{"$f":"'Week 1'!A94","v":"<Enter Participant 84>"},null,null,null,null,null,null,null,null,null,null,null,null,null,null,null,null,null,"pts",0,1,"","",0,null,{"$f":"IF(ISBLANK(B$6),\"\",IF(B94=B$6,1,0))","v":""},"","","","","","","","","","","","","","",""]
[{"$f":"'Week 1'!A95","v":"<Enter Participant 85>"},null,null,null,null,null,null,null,null,null,null,null,null,null,null,null,null,null,"pts",0,1,"","",0,null,"","","","","","","","","","","","","","","",""]
[{"$f":"'Week 1'!A96","v":"<Enter Participant 86>"},null,null,null,null,null,null,null,null,null,null,null,null,null,null,null,null,null,"pts",0,1,"","",0,null,"","","","","","","","","","","","","","","",""]
[{"$f":"'Week 1'!A97","v":"<Enter Participant 87>"},null,null,null,null,null,null,null,null,null,null,null,null,null,null,null,null,null,"pts",0,1,"","",0,null,"","","","","","","","","","","","","","","",""]
[{"$f":"'Week 1'!A98","v":"<Enter Participant 88>"},null,null,null,null,null,null,null,null,null,null,null,null,null,null,null,null,null,"pts",0,1,"","",0,null,"","","","","","","","","","","","","","","",""]
[{"$f":"'Week 1'!A99","v":"<Enter Participant 89>"},null,null,null,null,null,null,null,null,null,null,null,null,null,null,null,null,null,"pts",0,1,"","",0,null,"","","","","","","","","","","","","","","",""]
[{"$f":"'Week 1'!A100","v":"<Enter Participant 90>"},null,null,null,null,null,null,null,null,null,null,null,null,null,null,null,null,null,"pts",0,1,"","",0,null,"","","","","","","","","","","","","","","",""]
[{"$f":"'Week 1'!A101","v":"<Enter Participant 91>"},null,null,null,null,null,null,null,null,null,null,null,null,null,null,null,null,null,"pts",0,1,"","",0,null,"","","","","","","","","","","","","","","",""]
[{"$f":"'Week 1'!A102","v":"<Enter Participant 92>"},null,null,null,null,null,null,null,null,null,null,null,null,null,null,null,null,null,"pts",0,1,"","",0,null,"","","","","","","","","","","","","","","",""]
[{"$f":"'Week 1'!A103","v":"<Enter Participant 93>"},null,null,null,null,null,null,null,null,null,null,null,null,null,null,null,null,null,"pts",0,1,"","",0,null,"","","","","","","","","","","","","","","",""]
[{"$f":"'Week 1'!A104","v":"<Enter Participant 94>"},null,null,null,null,null,null,null,null,null,null,null,null,null,null,null,null,null,"pts",0,1,"","",0,null,"","","","","","","","","","","","","","","",""]
[{"$f":"'Week 1'!A105","v":"<Enter Participant 95>"},null,null,null,null,null,null,null,null,null,null,null,null,null,null,null,null,null,"pts",0,1,"","",0,null,"","","","","","","","","","","","","","","",""]
[{"$f":"'Week 1'!A106","v":"<Enter Participant 96>"},null,null,null,null,null,null,null,null,null,null,null,null,null,null,null,null,null,"pts",0,1,"","",0,null,"","","","","","","","","","","","","","","",""]
[{"$f":"'Week 1'!A107","v":"<Enter Participant 97>"},null,null,null,null,null,null,null,null,null,null,null,null,null,null,null,null,null,"pts",{"$f":"IF(SUM(Z107:AO107)=0,0,SUM(Z107:AO107))","v":0},1,"","",0,null,"","","","","","","","","","","","","","","",""]
[{"$f":"'Week 1'!A108","v":"<Enter Participant 98>"},null,null,null,null,null,null,null,null,null,null,null,null,null,null,null,null,null,"pts",0,1,"","",0,null,"","","","","","","","","","","","","","","",""]
[{"$f":"'Week 1'!A109","v":"<Enter Participant 99>"},null,null,null,null,null,null,null,null,null,null,null,null,null,null,null,null,null,"pts",0,1,"","",0,null,"","","","","","","","","","","","","","","",{"$f":"IF(ISBLANK(Q$6),\"\",IF(Q109=Q$6,1,0))","v":""}]
[{"$f":"'Week 1'!A110","v":"<Enter Participant 100>"},null,null,null,null,null,null,null,null,null,null,null,null,null,null,null,null,null,"pts",0,1,"","",0,null,{"$f":"IF(ISBLANK(B$6),\"\",IF(B110=B$6,1,0))","v":""},"","","","","","","","","","","","","","",""]

{"sheet":"Week 9","index":8,"n_rows":110,"n_cols":41,"rows_kept":110,"cut":false,"hidden":false,"merged":[[1,17,1,18],[1,19,3,23],[4,23,9,23],[9,17,9,18]]}
["Week Lookup Column Offset",2,3,4,5,6,7,8,9,10,11,12,13,14,15,16,17,null,null,null,null,null,null,{"$f":"MID(T2,FIND(\" \",T2)+1,2)*1+18","v":27}]
[null,"GAME 1","GAME 2","GAME 3","GAME 4","GAME 5","GAME 6","GAME 7","GAME 8","GAME 9","GAME 10","GAME 11","GAME 12","GAME 13","GAME 14","GAME 15","GAME 16","SCORE",null,"Week 9"]
["VISITOR",{"$f":"IF(VLOOKUP($T$2&\" Visitors\",SCHEDULE_TABLE,B$1,FALSE)=0,\"\",VLOOKUP($T$2&\" Visitors\",SCHEDULE_TABLE,B$1,FALSE))","v":"NO"},"JAX","TB","ARI","PHI","NYJ","SD","WAS","STL","DEN","OAK","BAL","IND","","","",null,"pts"]
[null,"at","at","at","at","at","at","at","at","at","at","at","at","at","at","at","at"]
["HOME",{"$f":"IF(VLOOKUP($T$2&\" Homes\",SCHEDULE_TABLE,B$1,FALSE)=0,\"\",VLOOKUP($T$2&\" Homes\",SCHEDULE_TABLE,B$1,FALSE))","v":"CAR"},"CIN","CLE","DAL","HOU","KC","MIA","MIN","SF","NE","SEA","PIT","NYG","","","",null,"pts",null,null,null,null,"TOTAL POINTS FOR YEAR"]
["WINNER",null,null,null,null,null,null,null,null,null,null,null,null,null,null,null,null,{"$f":"IF(R3+R5=0,\"\",R3+R5)","v":""},"pts"]
[null,{"$f":"B3","v":"NO"},"JAX","TB","ARI","PHI","NYJ","SD","WAS","STL","DEN","OAK","BAL","IND","","",""]
[null,{"$f":"B5","v":"CAR"},"CIN","CLE","DAL","HOU","KC","MIA","MIN","SF","NE","SEA","PIT","NYG","","",""]
[]
["NAME","PICKS","PICKS","PICKS","PICKS","PICKS","PICKS","PICKS","PICKS","PICKS","PICKS","PICKS","PICKS","PICKS","PICKS","PICKS","PICKS","TIE-BREAK",null,"PICK PTS","PTS RANK","ABS DIFF","TIE-BREAK"]
[{"$f":"'Week 1'!A11","v":"<Enter Participant 1>"},null,null,null,null,null,null,null,null,null,null,null,null,null,null,null,null,null,"pts",{"$f":"IF(SUM(Z11:AO11)=0,0,SUM(Z11:AO11))","v":0},{"$f":"IF(ISERROR(RANK(T11,$T$11:$T$85)),\"\",RANK(T11,$T$11:$T$85))","v":1},{"$f":"IF(ISBLANK(R11),\"\",IF(U11=1,ABS(R11-R$6),\"\"))","v":""},{"$f":"IF(ISERROR(RANK(V11,$V$11:$V$85,1)),\"\",RANK(V11,$V$11:$V$85,1))","v":""},{"$f":"VLOOKUP(A11,CUMULATIVE_TABLE,X$1,FALSE)","v":0},null,{"$f":"IF(ISBLANK(B$6),\"\",IF(B11=B$6,1,0))","v":""},"","","","","","","","","","","","","","",""]
[{"$f":"'Week 1'!A12","v":"<Enter Participant 2>"},null,null,null,null,null,null,null,null,null,null,null,null,null,null,null,null,null,"pts",0,1,"","",0,null,"","","","","","","","","","","","","","","",""]
[{"$f":"'Week 1'!A13","v":"<Enter Participant 3>"},null,null,null,null,null,null,null,null,null,null,null,null,null,null,null,null,null,"pts",0,1,"","",0,null,"","","","","","","","","","","","","","","",""]
[{"$f":"'Week 1'!A14","v":"<Enter Participant 4>"},null,null,null,null,null,null,null,null,null,null,null,null,null,null,null,null,null,"pts",0,1,"","",0,null,"","","","","","","","","","","","","","","",""]
[{"$f":"'Week 1'!A15","v":"<Enter Participant 5>"},null,null,null,null,null,null,null,null,null,null,null,null,null,null,null,null,null,"pts",0,1,"","",0,null,"","","","","","","","","","","","","","","",""]
[{"$f":"'Week 1'!A16","v":"<Enter Participant 6>"},null,null,null,null,null,null,null,null,null,null,null,null,null,null,null,null,null,"pts",0,1,"","",0,null,"","","","","","","","","","","","","","","",""]
[{"$f":"'Week 1'!A17","v":"<Enter Participant 7>"},null,null,null,null,null,null,null,null,null,null,null,null,null,null,null,null,null,"pts",0,1,"","",0,null,"","","","","","","","","","","","","","","",""]
[{"$f":"'Week 1'!A18","v":"<Enter Participant 8>"},null,null,null,null,null,null,null,null,null,null,null,null,null,null,null,null,null,"pts",0,1,"","",0,null,"","","","","","","","","","","","","","","",""]
[{"$f":"'Week 1'!A19","v":"<Enter Participant 9>"},null,null,null,null,null,null,null,null,null,null,null,null,null,null,null,null,null,"pts",0,1,"","",0,null,"","","","","","","","","","","","","","","",""]
[{"$f":"'Week 1'!A20","v":"<Enter Participant 10>"},null,null,null,null,null,null,null,null,null,null,null,null,null,null,null,null,null,"pts",0,1,"","",0,null,"","","","","","","","","","","","","","","",""]
[{"$f":"'Week 1'!A21","v":"<Enter Participant 11>"},null,null,null,null,null,null,null,null,null,null,null,null,null,null,null,null,null,"pts",0,1,"","",0,null,"","","","","","","","","","","","","","","",""]
[{"$f":"'Week 1'!A22","v":"<Enter Participant 12>"},null,null,null,null,null,null,null,null,null,null,null,null,null,null,null,null,null,"pts",0,1,"","",0,null,"","","","","","","","","","","","","","","",""]
[{"$f":"'Week 1'!A23","v":"<Enter Participant 13>"},null,null,null,null,null,null,null,null,null,null,null,null,null,null,null,null,null,"pts",0,1,"","",0,null,"","","","","","","","","","","","","","","",""]
[{"$f":"'Week 1'!A24","v":"<Enter Participant 14>"},null,null,null,null,null,null,null,null,null,null,null,null,null,null,null,null,null,"pts",0,1,"","",0,null,"","","","","","","","","","","","","","","",""]
[{"$f":"'Week 1'!A25","v":"<Enter Participant 15>"},null,null,null,null,null,null,null,null,null,null,null,null,null,null,null,null,null,"pts",0,1,"","",0,null,"","","","","","","","","","","","","","","",""]
[{"$f":"'Week 1'!A26","v":"<Enter Participant 16>"},null,null,null,null,null,null,null,null,null,null,null,null,null,null,null,null,null,"pts",0,1,"","",0,null,"","","","","","","","","","","","","","","",{"$f":"IF(ISBLANK(Q$6),\"\",IF(Q26=Q$6,1,0))","v":""}]
[{"$f":"'Week 1'!A27","v":"<Enter Participant 17>"},null,null,null,null,null,null,null,null,null,null,null,null,null,null,null,null,null,"pts",0,1,"","",0,null,{"$f":"IF(ISBLANK(B$6),\"\",IF(B27=B$6,1,0))","v":""},"","","","","","","","","","","","","","",""]
[{"$f":"'Week 1'!A28","v":"<Enter Participant 18>"},null,null,null,null,null,null,null,null,null,null,null,null,null,null,null,null,null,"pts",0,1,"","",0,null,"","","","","","","","","","","","","","","",""]
[{"$f":"'Week 1'!A29","v":"<Enter Participant 19>"},null,null,null,null,null,null,null,null,null,null,null,null,null,null,null,null,null,"pts",0,1,"","",0,null,"","","","","","","","","","","","","","","",""]
[{"$f":"'Week 1'!A30","v":"<Enter Participant 20>"},null,null,null,null,null,null,null,null,null,null,null,null,null,null,null,null,null,"pts",0,1,"","",0,null,"","","","","","","","","","","","","","","",""]
[{"$f":"'Week 1'!A31","v":"<Enter Participant 21>"},null,null,null,null,null,null,null,null,null,null,null,null,null,null,null,null,null,"pts",0,1,"","",0,null,"","","","","","","","","","","","","","","",""]
[{"$f":"'Week 1'!A32","v":"<Enter Participant 22>"},null,null,null,null,null,null,null,null,null,null,null,null,null,null,null,null,null,"pts",0,1,"","",0,null,"","","","","","","","","","","","","","","",""]
[{"$f":"'Week 1'!A33","v":"<Enter Participant 23>"},null,null,null,null,null,null,null,null,null,null,null,null,null,null,null,null,null,"pts",0,1,"","",0,null,"","","","","","","","","","","","","","","",""]
[{"$f":"'Week 1'!A34","v":"<Enter Participant 24>"},null,null,null,null,null,null,null,null,null,null,null,null,null,null,null,null,null,"pts",0,1,"","",0,null,"","","","","","","","","","","","","","","",""]
[{"$f":"'Week 1'!A35","v":"<Enter Participant 25>"},null,null,null,null,null,null,null,null,null,null,null,null,null,null,null,null,null,"pts",0,1,"","",0,null,"","","","","","","","","","","","","","","",""]
[{"$f":"'Week 1'!A36","v":"<Enter Participant 26>"},null,null,null,null,null,null,null,null,null,null,null,null,null,null,null,null,null,"pts",0,1,"","",0,null,"","","","","","","","","","","","","","","",""]
[{"$f":"'Week 1'!A37","v":"<Enter Participant 27>"},null,null,null,null,null,null,null,null,null,null,null,null,null,null,null,null,null,"pts",0,1,"","",0,null,"","","","","","","","","","","","","","","",""]
[{"$f":"'Week 1'!A38","v":"<Enter Participant 28>"},null,null,null,null,null,null,null,null,null,null,null,null,null,null,null,null,null,"pts",0,1,"","",0,null,"","","","","","","","","","","","","","","",""]
[{"$f":"'Week 1'!A39","v":"<Enter Participant 29>"},null,null,null,null,null,null,null,null,null,null,null,null,null,null,null,null,null,"pts",0,1,"","",0,null,"","","","","","","","","","","","","","","",""]
[{"$f":"'Week 1'!A40","v":"<Enter Participant 30>"},null,null,null,null,null,null,null,null,null,null,null,null,null,null,null,null,null,"pts",0,1,"","",0,null,"","","","","","","","","","","","","","","",""]
[{"$f":"'Week 1'!A41","v":"<Enter Participant 31>"},null,null,null,null,null,null,null,null,null,null,null,null,null,null,null,null,null,"pts",0,1,"","",0,null,"","","","","","","","","","","","","","","",""]
[{"$f":"'Week 1'!A42","v":"<Enter Participant 32>"},null,null,null,null,null,null,null,null,null,null,null,null,null,null,null,null,null,"pts",0,1,"","",0,null,"","","","","","","","","","","","","","","",""]
[{"$f":"'Week 1'!A43","v":"<Enter Participant 33>"},null,null,null,null,null,null,null,null,null,null,null,null,null,null,null,null,null,"pts",{"$f":"IF(SUM(Z43:AO43)=0,0,SUM(Z43:AO43))","v":0},1,"","",{"$f":"VLOOKUP(A43,CUMULATIVE_TABLE,X$1,FALSE)","v":0},null,"","","","","","","","","","","","","","","",""]
[{"$f":"'Week 1'!A44","v":"<Enter Participant 34>"},null,null,null,null,null,null,null,null,null,null,null,null,null,null,null,null,null,"pts",0,1,"","",0,null,{"$f":"IF(ISBLANK(B$6),\"\",IF(B44=B$6,1,0))","v":""},"","","","","","","","","","","","","","",""]
[{"$f":"'Week 1'!A45","v":"<Enter Participant 35>"},null,null,null,null,null,null,null,null,null,null,null,null,null,null,null,null,null,"pts",0,1,"","",0,null,"","","","","","","","","","","","","","","",""]
[{"$f":"'Week 1'!A46","v":"<Enter Participant 36>"},null,null,null,null,null,null,null,null,null,null,null,null,null,null,null,null,null,"pts",0,1,"","",0,null,"","","","","","","","","","","","","","","",""]
[{"$f":"'Week 1'!A47","v":"<Enter Participant 37>"},null,null,null,null,null,null,null,null,null,null,null,null,null,null,null,null,null,"pts",0,1,"","",0,null,"","","","","","","","","","","","","","","",""]
[{"$f":"'Week 1'!A48","v":"<Enter Participant 38>"},null,null,null,null,null,null,null,null,null,null,null,null,null,null,null,null,null,"pts",0,1,"","",0,null,"","","","","","","","","","","","","","","",""]
[{"$f":"'Week 1'!A49","v":"<Enter Participant 39>"},null,null,null,null,null,null,null,null,null,null,null,null,null,null,null,null,null,"pts",0,1,"","",0,null,"","","","","","","","","","","","","","","",""]
[{"$f":"'Week 1'!A50","v":"<Enter Participant 40>"},null,null,null,null,null,null,null,null,null,null,null,null,null,null,null,null,null,"pts",0,1,"","",0,null,"","","","","","","","","","","","","","","",""]
[{"$f":"'Week 1'!A51","v":"<Enter Participant 41>"},null,null,null,null,null,null,null,null,null,null,null,null,null,null,null,null,null,"pts",0,1,"","",0,null,"","","","","","","","","","","","","","","",""]
[{"$f":"'Week 1'!A52","v":"<Enter Participant 42>"},null,null,null,null,null,null,null,null,null,null,null,null,null,null,null,null,null,"pts",0,1,"","",0,null,"","","","","","","","","","","","","","","",""]
[{"$f":"'Week 1'!A53","v":"<Enter Participant 43>"},null,null,null,null,null,null,null,null,null,null,null,null,null,null,null,null,null,"pts",0,1,"","",0,null,"","","","","","","","","","","","","","","",""]
[{"$f":"'Week 1'!A54","v":"<Enter Participant 44>"},null,null,null,null,null,null,null,null,null,null,null,null,null,null,null,null,null,"pts",0,1,"","",0,null,"","","","","","","","","","","","","","","",""]
[{"$f":"'Week 1'!A55","v":"<Enter Participant 45>"},null,null,null,null,null,null,null,null,null,null,null,null,null,null,null,null,null,"pts",0,1,"","",0,null,"","","","","","","","","","","","","","","",""]
[{"$f":"'Week 1'!A56","v":"<Enter Participant 46>"},null,null,null,null,null,null,null,null,null,null,null,null,null,null,null,null,null,"pts",0,1,"","",0,null,"","","","","","","","","","","","","","","",""]
[{"$f":"'Week 1'!A57","v":"<Enter Participant 47>"},null,null,null,null,null,null,null,null,null,null,null,null,null,null,null,null,null,"pts",0,1,"","",0,null,"","","","","","","","","","","","","","","",""]
[{"$f":"'Week 1'!A58","v":"<Enter Participant 48>"},null,null,null,null,null,null,null,null,null,null,null,null,null,null,null,null,null,"pts",0,1,"","",0,null,"","","","","","","","","","","","","","","",""]
[{"$f":"'Week 1'!A59","v":"<Enter Participant 49>"},null,null,null,null,null,null,null,null,null,null,null,null,null,null,null,null,null,"pts",0,1,"","",0,null,"","","","","","","","","","","","","","","",""]
[{"$f":"'Week 1'!A60","v":"<Enter Participant 50>"},null,null,null,null,null,null,null,null,null,null,null,null,null,null,null,null,null,"pts",0,1,"","",0,null,"","","","","","","","","","","","","","","",""]
[{"$f":"'Week 1'!A61","v":"<Enter Participant 51>"},null,null,null,null,null,null,null,null,null,null,null,null,null,null,null,null,null,"pts",0,1,"","",0,null,{"$f":"IF(ISBLANK(B$6),\"\",IF(B61=B$6,1,0))","v":""},"","","","","","","","","","","","","","",""]
[{"$f":"'Week 1'!A62","v":"<Enter Participant 52>"},null,null,null,null,null,null,null,null,null,null,null,null,null,null,null,null,null,"pts",0,1,"","",0,null,"","","","","","","","","","","","","","","",""]
[{"$f":"'Week 1'!A63","v":"<Enter Participant 53>"},null,null,null,null,null,null,null,null,null,null,null,null,null,null,null,null,null,"pts",0,1,"","",0,null,"","","","","","","","","","","","","","","",""]
[{"$f":"'Week 1'!A64","v":"<Enter Participant 54>"},null,null,null,null,null,null,null,null,null,null,null,null,null,null,null,null,null,"pts",0,1,"","",0,null,"","","","","","","","","","","","","","","",""]
[{"$f":"'Week 1'!A65","v":"<Enter Participant 55>"},null,null,null,null,null,null,null,null,null,null,null,null,null,null,null,null,null,"pts",0,1,"","",0,null,"","","","","","","","","","","","","","","",""]
[{"$f":"'Week 1'!A66","v":"<Enter Participant 56>"},null,null,null,null,null,null,null,null,null,null,null,null,null,null,null,null,null,"pts",0,1,"","",0,null,"","","","","","","","","","","","","","","",""]
[{"$f":"'Week 1'!A67","v":"<Enter Participant 57>"},null,null,null,null,null,null,null,null,null,null,null,null,null,null,null,null,null,"pts",0,1,"","",0,null,"","","","","","","","","","","","","","","",""]
[{"$f":"'Week 1'!A68","v":"<Enter Participant 58>"},null,null,null,null,null,null,null,null,null,null,null,null,null,null,null,null,null,"pts",0,1,"","",0,null,"","","","","","","","","","","","","","","",""]
[{"$f":"'Week 1'!A69","v":"<Enter Participant 59>"},null,null,null,null,null,null,null,null,null,null,null,null,null,null,null,null,null,"pts",0,1,"","",0,null,"","","","","","","","","","","","","","","",""]
[{"$f":"'Week 1'!A70","v":"<Enter Participant 60>"},null,null,null,null,null,null,null,null,null,null,null,null,null,null,null,null,null,"pts",0,1,"","",0,null,"","","","","","","","","","","","","","","",""]
[{"$f":"'Week 1'!A71","v":"<Enter Participant 61>"},null,null,null,null,null,null,null,null,null,null,null,null,null,null,null,null,null,"pts",0,1,"","",0,null,"","","","","","","","","","","","","","","",""]
[{"$f":"'Week 1'!A72","v":"<Enter Participant 62>"},null,null,null,null,null,null,null,null,null,null,null,null,null,null,null,null,null,"pts",0,1,"","",0,null,"","","","","","","","","","","","","","","",""]
[{"$f":"'Week 1'!A73","v":"<Enter Participant 63>"},null,null,null,null,null,null,null,null,null,null,null,null,null,null,null,null,null,"pts",0,1,"","",0,null,"","","","","","","","","","","","","","","",""]
[{"$f":"'Week 1'!A74","v":"<Enter Participant 64>"},null,null,null,null,null,null,null,null,null,null,null,null,null,null,null,null,null,"pts",0,1,"","",0,null,"","","","","","","","","","","","","","","",""]
[{"$f":"'Week 1'!A75","v":"<Enter Participant 65>"},null,null,null,null,null,null,null,null,null,null,null,null,null,null,null,null,null,"pts",0,{"$f":"IF(ISERROR(RANK(T75,$T$11:$T$85)),\"\",RANK(T75,$T$11:$T$85))","v":1},{"$f":"IF(ISBLANK(R75),\"\",IF(U75=1,ABS(R75-R$6),\"\"))","v":""},{"$f":"IF(ISERROR(RANK(V75,$V$11:$V$85,1)),\"\",RANK(V75,$V$11:$V$85,1))","v":""},{"$f":"VLOOKUP(A75,CUMULATIVE_TABLE,X$1,FALSE)","v":0},null,"","","","","","","","","","","","","","","",""]
[{"$f":"'Week 1'!A76","v":"<Enter Participant 66>"},null,null,null,null,null,null,null,null,null,null,null,null,null,null,null,null,null,"pts",0,1,"","",0,null,"","","","","","","","","","","","","","","",""]
[{"$f":"'Week 1'!A77","v":"<Enter Participant 67>"},null,null,null,null,null,null,null,null,null,null,null,null,null,null,null,null,null,"pts",0,1,"","",0,null,"","","","","","","","","","","","","","","",""]
[{"$f":"'Week 1'!A78","v":"<Enter Participant 68>"},null,null,null,null,null,null,null,null,null,null,null,null,null,null,null,null,null,"pts",0,1,"","",0,null,{"$f":"IF(ISBLANK(B$6),\"\",IF(B78=B$6,1,0))","v":""},"","","","","","","","","","","","","","",""]
[{"$f":"'Week 1'!A79","v":"<Enter Participant 69>"},null,null,null,null,null,null,null,null,null,null,null,null,null,null,null,null,null,"pts",0,1,"","",0,null,"","","","","","","","","","","","","","","",""]
[{"$f":"'Week 1'!A80","v":"<Enter Participant 70>"},null,null,null,null,null,null,null,null,null,null,null,null,null,null,null,null,null,"pts",0,1,"","",0,null,"","","","","","","","","","","","","","","",""]
[{"$f":"'Week 1'!A81","v":"<Enter Participant 71>"},null,null,null,null,null,null,null,null,null,null,null,null,null,null,null,null,null,"pts",0,1,"","",0,null,"","","","","","","","","","","","","","","",""]
[{"$f":"'Week 1'!A82","v":"<Enter Participant 72>"},null,null,null,null,null,null,null,null,null,null,null,null,null,null,null,null,null,"pts",0,1,"","",0,null,"","","","","","","","","","","","","","","",""]
[{"$f":"'Week 1'!A83","v":"<Enter Participant 73>"},null,null,null,null,null,null,null,null,null,null,null,null,null,null,null,null,null,"pts",0,1,"","",0,null,"","","","","","","","","","","","","","","",""]
[{"$f":"'Week 1'!A84","v":"<Enter Participant 74>"},null,null,null,null,null,null,null,null,null,null,null,null,null,null,null,null,null,"pts",0,1,"","",0,null,"","","","","","","","","","","","","","","",""]
[{"$f":"'Week 1'!A85","v":"<Enter Participant 75>"},null,null,null,null,null,null,null,null,null,null,null,null,null,null,null,null,null,"pts",0,1,"","",0,null,"","","","","","","","","","","","","","","",""]
[{"$f":"'Week 1'!A86","v":"<Enter Participant 76>"},null,null,null,null,null,null,null,null,null,null,null,null,null,null,null,null,null,"pts",0,1,"","",0,null,"","","","","","","","","","","","","","","",""]
[{"$f":"'Week 1'!A87","v":"<Enter Participant 77>"},null,null,null,null,null,null,null,null,null,null,null,null,null,null,null,null,null,"pts",0,1,"","",0,null,"","","","","","","","","","","","","","","",""]
[{"$f":"'Week 1'!A88","v":"<Enter Participant 78>"},null,null,null,null,null,null,null,null,null,null,null,null,null,null,null,null,null,"pts",0,1,"","",0,null,"","","","","","","","","","","","","","","",""]
[{"$f":"'Week 1'!A89","v":"<Enter Participant 79>"},null,null,null,null,null,null,null,null,null,null,null,null,null,null,null,null,null,"pts",0,1,"","",0,null,"","","","","","","","","","","","","","","",""]
[{"$f":"'Week 1'!A90","v":"<Enter Participant 80>"},null,null,null,null,null,null,null,null,null,null,null,null,null,null,null,null,null,"pts",0,1,"","",0,null,"","","","","","","","","","","","","","","",""]
[{"$f":"'Week 1'!A91","v":"<Enter Participant 81>"},null,null,null,null,null,null,null,null,null,null,null,null,null,null,null,null,null,"pts",0,1,"","",0,null,"","","","","","","","","","","","","","","",""]
[{"$f":"'Week 1'!A92","v":"<Enter Participant 82>"},null,null,null,null,null,null,null,null,null,null,null,null,null,null,null,null,null,"pts",0,1,"","",0,null,"","","","","","","","","","","","","","","",""]
[{"$f":"'Week 1'!A93","v":"<Enter Participant 83>"},null,null,null,null,null,null,null,null,null,null,null,null,null,null,null,null,null,"pts",0,1,"","",0,null,"","","","","","","","","","","","","","","",""]
[{"$f":"'Week 1'!A94","v":"<Enter Participant 84>"},null,null,null,null,null,null,null,null,null,null,null,null,null,null,null,null,null,"pts",0,1,"","",0,null,{"$f":"IF(ISBLANK(B$6),\"\",IF(B94=B$6,1,0))","v":""},"","","","","","","","","","","","","","",""]
[{"$f":"'Week 1'!A95","v":"<Enter Participant 85>"},null,null,null,null,null,null,null,null,null,null,null,null,null,null,null,null,null,"pts",0,1,"","",0,null,"","","","","","","","","","","","","","","",""]
[{"$f":"'Week 1'!A96","v":"<Enter Participant 86>"},null,null,null,null,null,null,null,null,null,null,null,null,null,null,null,null,null,"pts",0,1,"","",0,null,"","","","","","","","","","","","","","","",""]
[{"$f":"'Week 1'!A97","v":"<Enter Participant 87>"},null,null,null,null,null,null,null,null,null,null,null,null,null,null,null,null,null,"pts",0,1,"","",0,null,"","","","","","","","","","","","","","","",""]
[{"$f":"'Week 1'!A98","v":"<Enter Participant 88>"},null,null,null,null,null,null,null,null,null,null,null,null,null,null,null,null,null,"pts",0,1,"","",0,null,"","","","","","","","","","","","","","","",""]
[{"$f":"'Week 1'!A99","v":"<Enter Participant 89>"},null,null,null,null,null,null,null,null,null,null,null,null,null,null,null,null,null,"pts",0,1,"","",0,null,"","","","","","","","","","","","","","","",""]
[{"$f":"'Week 1'!A100","v":"<Enter Participant 90>"},null,null,null,null,null,null,null,null,null,null,null,null,null,null,null,null,null,"pts",0,1,"","",0,null,"","","","","","","","","","","","","","","",""]
[{"$f":"'Week 1'!A101","v":"<Enter Participant 91>"},null,null,null,null,null,null,null,null,null,null,null,null,null,null,null,null,null,"pts",0,1,"","",0,null,"","","","","","","","","","","","","","","",""]
[{"$f":"'Week 1'!A102","v":"<Enter Participant 92>"},null,null,null,null,null,null,null,null,null,null,null,null,null,null,null,null,null,"pts",0,1,"","",0,null,"","","","","","","","","","","","","","","",""]
[{"$f":"'Week 1'!A103","v":"<Enter Participant 93>"},null,null,null,null,null,null,null,null,null,null,null,null,null,null,null,null,null,"pts",0,1,"","",0,null,"","","","","","","","","","","","","","","",""]
[{"$f":"'Week 1'!A104","v":"<Enter Participant 94>"},null,null,null,null,null,null,null,null,null,null,null,null,null,null,null,null,null,"pts",0,1,"","",0,null,"","","","","","","","","","","","","","","",""]
[{"$f":"'Week 1'!A105","v":"<Enter Participant 95>"},null,null,null,null,null,null,null,null,null,null,null,null,null,null,null,null,null,"pts",0,1,"","",0,null,"","","","","","","","","","","","","","","",""]
[{"$f":"'Week 1'!A106","v":"<Enter Participant 96>"},null,null,null,null,null,null,null,null,null,null,null,null,null,null,null,null,null,"pts",0,1,"","",0,null,"","","","","","","","","","","","","","","",""]
[{"$f":"'Week 1'!A107","v":"<Enter Participant 97>"},null,null,null,null,null,null,null,null,null,null,null,null,null,null,null,null,null,"pts",{"$f":"IF(SUM(Z107:AO107)=0,0,SUM(Z107:AO107))","v":0},1,"","",0,null,"","","","","","","","","","","","","","","",""]
[{"$f":"'Week 1'!A108","v":"<Enter Participant 98>"},null,null,null,null,null,null,null,null,null,null,null,null,null,null,null,null,null,"pts",0,1,"","",0,null,"","","","","","","","","","","","","","","",""]
[{"$f":"'Week 1'!A109","v":"<Enter Participant 99>"},null,null,null,null,null,null,null,null,null,null,null,null,null,null,null,null,null,"pts",0,1,"","",0,null,"","","","","","","","","","","","","","","",{"$f":"IF(ISBLANK(Q$6),\"\",IF(Q109=Q$6,1,0))","v":""}]
[{"$f":"'Week 1'!A110","v":"<Enter Participant 100>"},null,null,null,null,null,null,null,null,null,null,null,null,null,null,null,null,null,"pts",0,1,"","",0,null,{"$f":"IF(ISBLANK(B$6),\"\",IF(B110=B$6,1,0))","v":""},"","","","","","","","","","","","","","",""]

{"sheet":"Week 10","index":9,"n_rows":110,"n_cols":41,"rows_kept":110,"cut":false,"hidden":false,"merged":[[1,17,1,18],[1,19,3,23],[4,23,9,23],[9,17,9,18]]}
["Week Lookup Column Offset",2,3,4,5,6,7,8,9,10,11,12,13,14,15,16,17,null,null,null,null,null,null,{"$f":"MID(T2,FIND(\" \",T2)+1,2)*1+18","v":28}]
[null,"GAME 1","GAME 2","GAME 3","GAME 4","GAME 5","GAME 6","GAME 7","GAME 8","GAME 9","GAME 10","GAME 11","GAME 12","GAME 13","GAME 14","GAME 15","GAME 16","SCORE",null,"Week 10"]
["VISITOR",{"$f":"IF(VLOOKUP($T$2&\" Visitors\",SCHEDULE_TABLE,B$1,FALSE)=0,\"\",VLOOKUP($T$2&\" Visitors\",SCHEDULE_TABLE,B$1,FALSE))","v":"CLE"},"TEN","KC","MIA","DAL","SF","PIT","ATL","DEN","STL","NYG","CHI","CAR","","","",null,"pts"]
[null,"at","at","at","at","at","at","at","at","at","at","at","at","at","at","at","at"]
["HOME",{"$f":"IF(VLOOKUP($T$2&\" Homes\",SCHEDULE_TABLE,B$1,FALSE)=0,\"\",VLOOKUP($T$2&\" Homes\",SCHEDULE_TABLE,B$1,FALSE))","v":"CIN"},"BAL","BUF","DET","JAX","NO","NYJ","TB","OAK","ARI","SEA","GB","PHI","","","",null,"pts",null,null,null,null,"TOTAL POINTS FOR YEAR"]
["WINNER",null,null,null,null,null,null,null,null,null,null,null,null,null,null,null,null,{"$f":"IF(R3+R5=0,\"\",R3+R5)","v":""},"pts"]
[null,{"$f":"B3","v":"CLE"},"TEN","KC","MIA","DAL","SF","PIT","ATL","DEN","STL","NYG","CHI","CAR","","",""]
[null,{"$f":"B5","v":"CIN"},"BAL","BUF","DET","JAX","NO","NYJ","TB","OAK","ARI","SEA","GB","PHI","","",""]
[]
["NAME","PICKS","PICKS","PICKS","PICKS","PICKS","PICKS","PICKS","PICKS","PICKS","PICKS","PICKS","PICKS","PICKS","PICKS","PICKS","PICKS","TIE-BREAK",null,"PICK PTS","PTS RANK","ABS DIFF","TIE-BREAK"]
[{"$f":"'Week 1'!A11","v":"<Enter Participant 1>"},null,null,null,null,null,null,null,null,null,null,null,null,null,null,null,null,null,"pts",{"$f":"IF(SUM(Z11:AO11)=0,0,SUM(Z11:AO11))","v":0},{"$f":"IF(ISERROR(RANK(T11,$T$11:$T$85)),\"\",RANK(T11,$T$11:$T$85))","v":1},{"$f":"IF(ISBLANK(R11),\"\",IF(U11=1,ABS(R11-R$6),\"\"))","v":""},{"$f":"IF(ISERROR(RANK(V11,$V$11:$V$85,1)),\"\",RANK(V11,$V$11:$V$85,1))","v":""},{"$f":"VLOOKUP(A11,CUMULATIVE_TABLE,X$1,FALSE)","v":0},null,{"$f":"IF(ISBLANK(B$6),\"\",IF(B11=B$6,1,0))","v":""},"","","","","","","","","","","","","","",""]
[{"$f":"'Week 1'!A12","v":"<Enter Participant 2>"},null,null,null,null,null,null,null,null,null,null,null,null,null,null,null,null,null,"pts",0,1,"","",0,null,"","","","","","","","","","","","","","","",""]
[{"$f":"'Week 1'!A13","v":"<Enter Participant 3>"},null,null,null,null,null,null,null,null,null,null,null,null,null,null,null,null,null,"pts",0,1,"","",0,null,"","","","","","","","","","","","","","","",""]
[{"$f":"'Week 1'!A14","v":"<Enter Participant 4>"},null,null,null,null,null,null,null,null,null,null,null,null,null,null,null,null,null,"pts",0,1,"","",0,null,"","","","","","","","","","","","","","","",""]
[{"$f":"'Week 1'!A15","v":"<Enter Participant 5>"},null,null,null,null,null,null,null,null,null,null,null,null,null,null,null,null,null,"pts",0,1,"","",0,null,"","","","","","","","","","","","","","","",""]
[{"$f":"'Week 1'!A16","v":"<Enter Participant 6>"},null,null,null,null,null,null,null,null,null,null,null,null,null,null,null,null,null,"pts",0,1,"","",0,null,"","","","","","","","","","","","","","","",""]
[{"$f":"'Week 1'!A17","v":"<Enter Participant 7>"},null,null,null,null,null,null,null,null,null,null,null,null,null,null,null,null,null,"pts",0,1,"","",0,null,"","","","","","","","","","","","","","","",""]
[{"$f":"'Week 1'!A18","v":"<Enter Participant 8>"},null,null,null,null,null,null,null,null,null,null,null,null,null,null,null,null,null,"pts",0,1,"","",0,null,"","","","","","","","","","","","","","","",""]
[{"$f":"'Week 1'!A19","v":"<Enter Participant 9>"},null,null,null,null,null,null,null,null,null,null,null,null,null,null,null,null,null,"pts",0,1,"","",0,null,"","","","","","","","","","","","","","","",""]
[{"$f":"'Week 1'!A20","v":"<Enter Participant 10>"},null,null,null,null,null,null,null,null,null,null,null,null,null,null,null,null,null,"pts",0,1,"","",0,null,"","","","","","","","","","","","","","","",""]
[{"$f":"'Week 1'!A21","v":"<Enter Participant 11>"},null,null,null,null,null,null,null,null,null,null,null,null,null,null,null,null,null,"pts",0,1,"","",0,null,"","","","","","","","","","","","","","","",""]
[{"$f":"'Week 1'!A22","v":"<Enter Participant 12>"},null,null,null,null,null,null,null,null,null,null,null,null,null,null,null,null,null,"pts",0,1,"","",0,null,"","","","","","","","","","","","","","","",""]
[{"$f":"'Week 1'!A23","v":"<Enter Participant 13>"},null,null,null,null,null,null,null,null,null,null,null,null,null,null,null,null,null,"pts",0,1,"","",0,null,"","","","","","","","","","","","","","","",""]
[{"$f":"'Week 1'!A24","v":"<Enter Participant 14>"},null,null,null,null,null,null,null,null,null,null,null,null,null,null,null,null,null,"pts",0,1,"","",0,null,"","","","","","","","","","","","","","","",""]
[{"$f":"'Week 1'!A25","v":"<Enter Participant 15>"},null,null,null,null,null,null,null,null,null,null,null,null,null,null,null,null,null,"pts",0,1,"","",0,null,"","","","","","","","","","","","","","","",""]
[{"$f":"'Week 1'!A26","v":"<Enter Participant 16>"},null,null,null,null,null,null,null,null,null,null,null,null,null,null,null,null,null,"pts",0,1,"","",0,null,"","","","","","","","","","","","","","","",{"$f":"IF(ISBLANK(Q$6),\"\",IF(Q26=Q$6,1,0))","v":""}]
[{"$f":"'Week 1'!A27","v":"<Enter Participant 17>"},null,null,null,null,null,null,null,null,null,null,null,null,null,null,null,null,null,"pts",0,1,"","",0,null,{"$f":"IF(ISBLANK(B$6),\"\",IF(B27=B$6,1,0))","v":""},"","","","","","","","","","","","","","",""]
[{"$f":"'Week 1'!A28","v":"<Enter Participant 18>"},null,null,null,null,null,null,null,null,null,null,null,null,null,null,null,null,null,"pts",0,1,"","",0,null,"","","","","","","","","","","","","","","",""]
[{"$f":"'Week 1'!A29","v":"<Enter Participant 19>"},null,null,null,null,null,null,null,null,null,null,null,null,null,null,null,null,null,"pts",0,1,"","",0,null,"","","","","","","","","","","","","","","",""]
[{"$f":"'Week 1'!A30","v":"<Enter Participant 20>"},null,null,null,null,null,null,null,null,null,null,null,null,null,null,null,null,null,"pts",0,1,"","",0,null,"","","","","","","","","","","","","","","",""]
[{"$f":"'Week 1'!A31","v":"<Enter Participant 21>"},null,null,null,null,null,null,null,null,null,null,null,null,null,null,null,null,null,"pts",0,1,"","",0,null,"","","","","","","","","","","","","","","",""]
[{"$f":"'Week 1'!A32","v":"<Enter Participant 22>"},null,null,null,null,null,null,null,null,null,null,null,null,null,null,null,null,null,"pts",0,1,"","",0,null,"","","","","","","","","","","","","","","",""]
[{"$f":"'Week 1'!A33","v":"<Enter Participant 23>"},null,null,null,null,null,null,null,null,null,null,null,null,null,null,null,null,null,"pts",0,1,"","",0,null,"","","","","","","","","","","","","","","",""]
[{"$f":"'Week 1'!A34","v":"<Enter Participant 24>"},null,null,null,null,null,null,null,null,null,null,null,null,null,null,null,null,null,"pts",0,1,"","",0,null,"","","","","","","","","","","","","","","",""]
[{"$f":"'Week 1'!A35","v":"<Enter Participant 25>"},null,null,null,null,null,null,null,null,null,null,null,null,null,null,null,null,null,"pts",0,1,"","",0,null,"","","","","","","","","","","","","","","",""]
[{"$f":"'Week 1'!A36","v":"<Enter Participant 26>"},null,null,null,null,null,null,null,null,null,null,null,null,null,null,null,null,null,"pts",0,1,"","",0,null,"","","","","","","","","","","","","","","",""]
[{"$f":"'Week 1'!A37","v":"<Enter Participant 27>"},null,null,null,null,null,null,null,null,null,null,null,null,null,null,null,null,null,"pts",0,1,"","",0,null,"","","","","","","","","","","","","","","",""]
[{"$f":"'Week 1'!A38","v":"<Enter Participant 28>"},null,null,null,null,null,null,null,null,null,null,null,null,null,null,null,null,null,"pts",0,1,"","",0,null,"","","","","","","","","","","","","","","",""]
[{"$f":"'Week 1'!A39","v":"<Enter Participant 29>"},null,null,null,null,null,null,null,null,null,null,null,null,null,null,null,null,null,"pts",0,1,"","",0,null,"","","","","","","","","","","","","","","",""]
[{"$f":"'Week 1'!A40","v":"<Enter Participant 30>"},null,null,null,null,null,null,null,null,null,null,null,null,null,null,null,null,null,"pts",0,1,"","",0,null,"","","","","","","","","","","","","","","",""]
[{"$f":"'Week 1'!A41","v":"<Enter Participant 31>"},null,null,null,null,null,null,null,null,null,null,null,null,null,null,null,null,null,"pts",0,1,"","",0,null,"","","","","","","","","","","","","","","",""]
[{"$f":"'Week 1'!A42","v":"<Enter Participant 32>"},null,null,null,null,null,null,null,null,null,null,null,null,null,null,null,null,null,"pts",0,1,"","",0,null,"","","","","","","","","","","","","","","",""]
[{"$f":"'Week 1'!A43","v":"<Enter Participant 33>"},null,null,null,null,null,null,null,null,null,null,null,null,null,null,null,null,null,"pts",{"$f":"IF(SUM(Z43:AO43)=0,0,SUM(Z43:AO43))","v":0},1,"","",{"$f":"VLOOKUP(A43,CUMULATIVE_TABLE,X$1,FALSE)","v":0},null,"","","","","","","","","","","","","","","",""]
[{"$f":"'Week 1'!A44","v":"<Enter Participant 34>"},null,null,null,null,null,null,null,null,null,null,null,null,null,null,null,null,null,"pts",0,1,"","",0,null,{"$f":"IF(ISBLANK(B$6),\"\",IF(B44=B$6,1,0))","v":""},"","","","","","","","","","","","","","",""]
[{"$f":"'Week 1'!A45","v":"<Enter Participant 35>"},null,null,null,null,null,null,null,null,null,null,null,null,null,null,null,null,null,"pts",0,1,"","",0,null,"","","","","","","","","","","","","","","",""]
[{"$f":"'Week 1'!A46","v":"<Enter Participant 36>"},null,null,null,null,null,null,null,null,null,null,null,null,null,null,null,null,null,"pts",0,1,"","",0,null,"","","","","","","","","","","","","","","",""]
[{"$f":"'Week 1'!A47","v":"<Enter Participant 37>"},null,null,null,null,null,null,null,null,null,null,null,null,null,null,null,null,null,"pts",0,1,"","",0,null,"","","","","","","","","","","","","","","",""]
[{"$f":"'Week 1'!A48","v":"<Enter Participant 38>"},null,null,null,null,null,null,null,null,null,null,null,null,null,null,null,null,null,"pts",0,1,"","",0,null,"","","","","","","","","","","","","","","",""]
[{"$f":"'Week 1'!A49","v":"<Enter Participant 39>"},null,null,null,null,null,null,null,null,null,null,null,null,null,null,null,null,null,"pts",0,1,"","",0,null,"","","","","","","","","","","","","","","",""]
[{"$f":"'Week 1'!A50","v":"<Enter Participant 40>"},null,null,null,null,null,null,null,null,null,null,null,null,null,null,null,null,null,"pts",0,1,"","",0,null,"","","","","","","","","","","","","","","",""]
[{"$f":"'Week 1'!A51","v":"<Enter Participant 41>"},null,null,null,null,null,null,null,null,null,null,null,null,null,null,null,null,null,"pts",0,1,"","",0,null,"","","","","","","","","","","","","","","",""]
[{"$f":"'Week 1'!A52","v":"<Enter Participant 42>"},null,null,null,null,null,null,null,null,null,null,null,null,null,null,null,null,null,"pts",0,1,"","",0,null,"","","","","","","","","","","","","","","",""]
[{"$f":"'Week 1'!A53","v":"<Enter Participant 43>"},null,null,null,null,null,null,null,null,null,null,null,null,null,null,null,null,null,"pts",0,1,"","",0,null,"","","","","","","","","","","","","","","",""]
[{"$f":"'Week 1'!A54","v":"<Enter Participant 44>"},null,null,null,null,null,null,null,null,null,null,null,null,null,null,null,null,null,"pts",0,1,"","",0,null,"","","","","","","","","","","","","","","",""]
[{"$f":"'Week 1'!A55","v":"<Enter Participant 45>"},null,null,null,null,null,null,null,null,null,null,null,null,null,null,null,null,null,"pts",0,1,"","",0,null,"","","","","","","","","","","","","","","",""]
[{"$f":"'Week 1'!A56","v":"<Enter Participant 46>"},null,null,null,null,null,null,null,null,null,null,null,null,null,null,null,null,null,"pts",0,1,"","",0,null,"","","","","","","","","","","","","","","",""]
[{"$f":"'Week 1'!A57","v":"<Enter Participant 47>"},null,null,null,null,null,null,null,null,null,null,null,null,null,null,null,null,null,"pts",0,1,"","",0,null,"","","","","","","","","","","","","","","",""]
[{"$f":"'Week 1'!A58","v":"<Enter Participant 48>"},null,null,null,null,null,null,null,null,null,null,null,null,null,null,null,null,null,"pts",0,1,"","",0,null,"","","","","","","","","","","","","","","",""]
[{"$f":"'Week 1'!A59","v":"<Enter Participant 49>"},null,null,null,null,null,null,null,null,null,null,null,null,null,null,null,null,null,"pts",0,1,"","",0,null,"","","","","","","","","","","","","","","",""]
[{"$f":"'Week 1'!A60","v":"<Enter Participant 50>"},null,null,null,null,null,null,null,null,null,null,null,null,null,null,null,null,null,"pts",0,1,"","",0,null,"","","","","","","","","","","","","","","",""]
[{"$f":"'Week 1'!A61","v":"<Enter Participant 51>"},null,null,null,null,null,null,null,null,null,null,null,null,null,null,null,null,null,"pts",0,1,"","",0,null,{"$f":"IF(ISBLANK(B$6),\"\",IF(B61=B$6,1,0))","v":""},"","","","","","","","","","","","","","",""]
[{"$f":"'Week 1'!A62","v":"<Enter Participant 52>"},null,null,null,null,null,null,null,null,null,null,null,null,null,null,null,null,null,"pts",0,1,"","",0,null,"","","","","","","","","","","","","","","",""]
[{"$f":"'Week 1'!A63","v":"<Enter Participant 53>"},null,null,null,null,null,null,null,null,null,null,null,null,null,null,null,null,null,"pts",0,1,"","",0,null,"","","","","","","","","","","","","","","",""]
[{"$f":"'Week 1'!A64","v":"<Enter Participant 54>"},null,null,null,null,null,null,null,null,null,null,null,null,null,null,null,null,null,"pts",0,1,"","",0,null,"","","","","","","","","","","","","","","",""]
[{"$f":"'Week 1'!A65","v":"<Enter Participant 55>"},null,null,null,null,null,null,null,null,null,null,null,null,null,null,null,null,null,"pts",0,1,"","",0,null,"","","","","","","","","","","","","","","",""]
[{"$f":"'Week 1'!A66","v":"<Enter Participant 56>"},null,null,null,null,null,null,null,null,null,null,null,null,null,null,null,null,null,"pts",0,1,"","",0,null,"","","","","","","","","","","","","","","",""]
[{"$f":"'Week 1'!A67","v":"<Enter Participant 57>"},null,null,null,null,null,null,null,null,null,null,null,null,null,null,null,null,null,"pts",0,1,"","",0,null,"","","","","","","","","","","","","","","",""]
[{"$f":"'Week 1'!A68","v":"<Enter Participant 58>"},null,null,null,null,null,null,null,null,null,null,null,null,null,null,null,null,null,"pts",0,1,"","",0,null,"","","","","","","","","","","","","","","",""]
[{"$f":"'Week 1'!A69","v":"<Enter Participant 59>"},null,null,null,null,null,null,null,null,null,null,null,null,null,null,null,null,null,"pts",0,1,"","",0,null,"","","","","","","","","","","","","","","",""]
[{"$f":"'Week 1'!A70","v":"<Enter Participant 60>"},null,null,null,null,null,null,null,null,null,null,null,null,null,null,null,null,null,"pts",0,1,"","",0,null,"","","","","","","","","","","","","","","",""]
[{"$f":"'Week 1'!A71","v":"<Enter Participant 61>"},null,null,null,null,null,null,null,null,null,null,null,null,null,null,null,null,null,"pts",0,1,"","",0,null,"","","","","","","","","","","","","","","",""]
[{"$f":"'Week 1'!A72","v":"<Enter Participant 62>"},null,null,null,null,null,null,null,null,null,null,null,null,null,null,null,null,null,"pts",0,1,"","",0,null,"","","","","","","","","","","","","","","",""]
[{"$f":"'Week 1'!A73","v":"<Enter Participant 63>"},null,null,null,null,null,null,null,null,null,null,null,null,null,null,null,null,null,"pts",0,1,"","",0,null,"","","","","","","","","","","","","","","",""]
[{"$f":"'Week 1'!A74","v":"<Enter Participant 64>"},null,null,null,null,null,null,null,null,null,null,null,null,null,null,null,null,null,"pts",0,1,"","",0,null,"","","","","","","","","","","","","","","",""]
[{"$f":"'Week 1'!A75","v":"<Enter Participant 65>"},null,null,null,null,null,null,null,null,null,null,null,null,null,null,null,null,null,"pts",0,{"$f":"IF(ISERROR(RANK(T75,$T$11:$T$85)),\"\",RANK(T75,$T$11:$T$85))","v":1},{"$f":"IF(ISBLANK(R75),\"\",IF(U75=1,ABS(R75-R$6),\"\"))","v":""},{"$f":"IF(ISERROR(RANK(V75,$V$11:$V$85,1)),\"\",RANK(V75,$V$11:$V$85,1))","v":""},{"$f":"VLOOKUP(A75,CUMULATIVE_TABLE,X$1,FALSE)","v":0},null,"","","","","","","","","","","","","","","",""]
[{"$f":"'Week 1'!A76","v":"<Enter Participant 66>"},null,null,null,null,null,null,null,null,null,null,null,null,null,null,null,null,null,"pts",0,1,"","",0,null,"","","","","","","","","","","","","","","",""]
[{"$f":"'Week 1'!A77","v":"<Enter Participant 67>"},null,null,null,null,null,null,null,null,null,null,null,null,null,null,null,null,null,"pts",0,1,"","",0,null,"","","","","","","","","","","","","","","",""]
[{"$f":"'Week 1'!A78","v":"<Enter Participant 68>"},null,null,null,null,null,null,null,null,null,null,null,null,null,null,null,null,null,"pts",0,1,"","",0,null,{"$f":"IF(ISBLANK(B$6),\"\",IF(B78=B$6,1,0))","v":""},"","","","","","","","","","","","","","",""]
[{"$f":"'Week 1'!A79","v":"<Enter Participant 69>"},null,null,null,null,null,null,null,null,null,null,null,null,null,null,null,null,null,"pts",0,1,"","",0,null,"","","","","","","","","","","","","","","",""]
[{"$f":"'Week 1'!A80","v":"<Enter Participant 70>"},null,null,null,null,null,null,null,null,null,null,null,null,null,null,null,null,null,"pts",0,1,"","",0,null,"","","","","","","","","","","","","","","",""]
[{"$f":"'Week 1'!A81","v":"<Enter Participant 71>"},null,null,null,null,null,null,null,null,null,null,null,null,null,null,null,null,null,"pts",0,1,"","",0,null,"","","","","","","","","","","","","","","",""]
[{"$f":"'Week 1'!A82","v":"<Enter Participant 72>"},null,null,null,null,null,null,null,null,null,null,null,null,null,null,null,null,null,"pts",0,1,"","",0,null,"","","","","","","","","","","","","","","",""]
[{"$f":"'Week 1'!A83","v":"<Enter Participant 73>"},null,null,null,null,null,null,null,null,null,null,null,null,null,null,null,null,null,"pts",0,1,"","",0,null,"","","","","","","","","","","","","","","",""]
[{"$f":"'Week 1'!A84","v":"<Enter Participant 74>"},null,null,null,null,null,null,null,null,null,null,null,null,null,null,null,null,null,"pts",0,1,"","",0,null,"","","","","","","","","","","","","","","",""]
[{"$f":"'Week 1'!A85","v":"<Enter Participant 75>"},null,null,null,null,null,null,null,null,null,null,null,null,null,null,null,null,null,"pts",0,1,"","",0,null,"","","","","","","","","","","","","","","",""]
[{"$f":"'Week 1'!A86","v":"<Enter Participant 76>"},null,null,null,null,null,null,null,null,null,null,null,null,null,null,null,null,null,"pts",0,1,"","",0,null,"","","","","","","","","","","","","","","",""]
[{"$f":"'Week 1'!A87","v":"<Enter Participant 77>"},null,null,null,null,null,null,null,null,null,null,null,null,null,null,null,null,null,"pts",0,1,"","",0,null,"","","","","","","","","","","","","","","",""]
[{"$f":"'Week 1'!A88","v":"<Enter Participant 78>"},null,null,null,null,null,null,null,null,null,null,null,null,null,null,null,null,null,"pts",0,1,"","",0,null,"","","","","","","","","","","","","","","",""]
[{"$f":"'Week 1'!A89","v":"<Enter Participant 79>"},null,null,null,null,null,null,null,null,null,null,null,null,null,null,null,null,null,"pts",0,1,"","",0,null,"","","","","","","","","","","","","","","",""]
[{"$f":"'Week 1'!A90","v":"<Enter Participant 80>"},null,null,null,null,null,null,null,null,null,null,null,null,null,null,null,null,null,"pts",0,1,"","",0,null,"","","","","","","","","","","","","","","",""]
[{"$f":"'Week 1'!A91","v":"<Enter Participant 81>"},null,null,null,null,null,null,null,null,null,null,null,null,null,null,null,null,null,"pts",0,1,"","",0,null,"","","","","","","","","","","","","","","",""]
[{"$f":"'Week 1'!A92","v":"<Enter Participant 82>"},null,null,null,null,null,null,null,null,null,null,null,null,null,null,null,null,null,"pts",0,1,"","",0,null,"","","","","","","","","","","","","","","",""]
[{"$f":"'Week 1'!A93","v":"<Enter Participant 83>"},null,null,null,null,null,null,null,null,null,null,null,null,null,null,null,null,null,"pts",0,1,"","",0,null,"","","","","","","","","","","","","","","",""]
[{"$f":"'Week 1'!A94","v":"<Enter Participant 84>"},null,null,null,null,null,null,null,null,null,null,null,null,null,null,null,null,null,"pts",0,1,"","",0,null,{"$f":"IF(ISBLANK(B$6),\"\",IF(B94=B$6,1,0))","v":""},"","","","","","","","","","","","","","",""]
[{"$f":"'Week 1'!A95","v":"<Enter Participant 85>"},null,null,null,null,null,null,null,null,null,null,null,null,null,null,null,null,null,"pts",0,1,"","",0,null,"","","","","","","","","","","","","","","",""]
[{"$f":"'Week 1'!A96","v":"<Enter Participant 86>"},null,null,null,null,null,null,null,null,null,null,null,null,null,null,null,null,null,"pts",0,1,"","",0,null,"","","","","","","","","","","","","","","",""]
[{"$f":"'Week 1'!A97","v":"<Enter Participant 87>"},null,null,null,null,null,null,null,null,null,null,null,null,null,null,null,null,null,"pts",0,1,"","",0,null,"","","","","","","","","","","","","","","",""]
[{"$f":"'Week 1'!A98","v":"<Enter Participant 88>"},null,null,null,null,null,null,null,null,null,null,null,null,null,null,null,null,null,"pts",0,1,"","",0,null,"","","","","","","","","","","","","","","",""]
[{"$f":"'Week 1'!A99","v":"<Enter Participant 89>"},null,null,null,null,null,null,null,null,null,null,null,null,null,null,null,null,null,"pts",0,1,"","",0,null,"","","","","","","","","","","","","","","",""]
[{"$f":"'Week 1'!A100","v":"<Enter Participant 90>"},null,null,null,null,null,null,null,null,null,null,null,null,null,null,null,null,null,"pts",0,1,"","",0,null,"","","","","","","","","","","","","","","",""]
[{"$f":"'Week 1'!A101","v":"<Enter Participant 91>"},null,null,null,null,null,null,null,null,null,null,null,null,null,null,null,null,null,"pts",0,1,"","",0,null,"","","","","","","","","","","","","","","",""]
[{"$f":"'Week 1'!A102","v":"<Enter Participant 92>"},null,null,null,null,null,null,null,null,null,null,null,null,null,null,null,null,null,"pts",0,1,"","",0,null,"","","","","","","","","","","","","","","",""]
[{"$f":"'Week 1'!A103","v":"<Enter Participant 93>"},null,null,null,null,null,null,null,null,null,null,null,null,null,null,null,null,null,"pts",0,1,"","",0,null,"","","","","","","","","","","","","","","",""]
[{"$f":"'Week 1'!A104","v":"<Enter Participant 94>"},null,null,null,null,null,null,null,null,null,null,null,null,null,null,null,null,null,"pts",0,1,"","",0,null,"","","","","","","","","","","","","","","",""]
[{"$f":"'Week 1'!A105","v":"<Enter Participant 95>"},null,null,null,null,null,null,null,null,null,null,null,null,null,null,null,null,null,"pts",0,1,"","",0,null,"","","","","","","","","","","","","","","",""]
[{"$f":"'Week 1'!A106","v":"<Enter Participant 96>"},null,null,null,null,null,null,null,null,null,null,null,null,null,null,null,null,null,"pts",0,1,"","",0,null,"","","","","","","","","","","","","","","",""]
[{"$f":"'Week 1'!A107","v":"<Enter Participant 97>"},null,null,null,null,null,null,null,null,null,null,null,null,null,null,null,null,null,"pts",{"$f":"IF(SUM(Z107:AO107)=0,0,SUM(Z107:AO107))","v":0},1,"","",0,null,"","","","","","","","","","","","","","","",""]
[{"$f":"'Week 1'!A108","v":"<Enter Participant 98>"},null,null,null,null,null,null,null,null,null,null,null,null,null,null,null,null,null,"pts",0,1,"","",0,null,"","","","","","","","","","","","","","","",""]
[{"$f":"'Week 1'!A109","v":"<Enter Participant 99>"},null,null,null,null,null,null,null,null,null,null,null,null,null,null,null,null,null,"pts",0,1,"","",0,null,"","","","","","","","","","","","","","","",{"$f":"IF(ISBLANK(Q$6),\"\",IF(Q109=Q$6,1,0))","v":""}]
[{"$f":"'Week 1'!A110","v":"<Enter Participant 100>"},null,null,null,null,null,null,null,null,null,null,null,null,null,null,null,null,null,"pts",0,1,"","",0,null,{"$f":"IF(ISBLANK(B$6),\"\",IF(B110=B$6,1,0))","v":""},"","","","","","","","","","","","","","",""]

{"sheet":"Week 11","index":10,"n_rows":110,"n_cols":41,"rows_kept":110,"cut":false,"hidden":false,"merged":[[1,17,1,18],[1,19,3,23],[4,23,9,23],[9,17,9,18]]}
["Week Lookup Column Offset",2,3,4,5,6,7,8,9,10,11,12,13,14,15,16,17,null,null,null,null,null,null,{"$f":"MID(T2,FIND(\" \",T2)+1,2)*1+18","v":29}]
[null,"GAME 1","GAME 2","GAME 3","GAME 4","GAME 5","GAME 6","GAME 7","GAME 8","GAME 9","GAME 10","GAME 11","GAME 12","GAME 13","GAME 14","GAME 15","GAME 16","SCORE",null,"Week 11"]
["VISITOR",{"$f":"IF(VLOOKUP($T$2&\" Visitors\",SCHEDULE_TABLE,B$1,FALSE)=0,\"\",VLOOKUP($T$2&\" Visitors\",SCHEDULE_TABLE,B$1,FALSE))","v":"BUF"},"ATL","MIN","HOU","PHI","SEA","CIN","SF","DEN","TB","OAK","DET","NE","PIT","","",null,"pts"]
[null,"at","at","at","at","at","at","at","at","at","at","at","at","at","at","at","at"]
["HOME",{"$f":"IF(VLOOKUP($T$2&\" Homes\",SCHEDULE_TABLE,B$1,FALSE)=0,\"\",VLOOKUP($T$2&\" Homes\",SCHEDULE_TABLE,B$1,FALSE))","v":"MIA"},"CAR","CHI","CLE","GB","KC","NO","NYG","STL","WAS","SD","ARI","IND","TEN","","",null,"pts",null,null,null,null,"TOTAL POINTS FOR YEAR"]
["WINNER",null,null,null,null,null,null,null,null,null,null,null,null,null,null,null,null,{"$f":"IF(R3+R5=0,\"\",R3+R5)","v":""},"pts"]
[null,{"$f":"B3","v":"BUF"},"ATL","MIN","HOU","PHI","SEA","CIN","SF","DEN","TB","OAK","DET","NE","PIT","",""]
[null,{"$f":"B5","v":"MIA"},"CAR","CHI","CLE","GB","KC","NO","NYG","STL","WAS","SD","ARI","IND","TEN","",""]
[]
["NAME","PICKS","PICKS","PICKS","PICKS","PICKS","PICKS","PICKS","PICKS","PICKS","PICKS","PICKS","PICKS","PICKS","PICKS","PICKS","PICKS","TIE-BREAK",null,"PICK PTS","PTS RANK","ABS DIFF","TIE-BREAK"]
[{"$f":"'Week 1'!A11","v":"<Enter Participant 1>"},null,null,null,null,null,null,null,null,null,null,null,null,null,null,null,null,null,"pts",{"$f":"IF(SUM(Z11:AO11)=0,0,SUM(Z11:AO11))","v":0},{"$f":"IF(ISERROR(RANK(T11,$T$11:$T$85)),\"\",RANK(T11,$T$11:$T$85))","v":1},{"$f":"IF(ISBLANK(R11),\"\",IF(U11=1,ABS(R11-R$6),\"\"))","v":""},{"$f":"IF(ISERROR(RANK(V11,$V$11:$V$85,1)),\"\",RANK(V11,$V$11:$V$85,1))","v":""},{"$f":"VLOOKUP(A11,CUMULATIVE_TABLE,X$1,FALSE)","v":0},null,{"$f":"IF(ISBLANK(B$6),\"\",IF(B11=B$6,1,0))","v":""},"","","","","","","","","","","","","","",""]
[{"$f":"'Week 1'!A12","v":"<Enter Participant 2>"},null,null,null,null,null,null,null,null,null,null,null,null,null,null,null,null,null,"pts",0,1,"","",0,null,"","","","","","","","","","","","","","","",""]
[{"$f":"'Week 1'!A13","v":"<Enter Participant 3>"},null,null,null,null,null,null,null,null,null,null,null,null,null,null,null,null,null,"pts",0,1,"","",0,null,"","","","","","","","","","","","","","","",""]
[{"$f":"'Week 1'!A14","v":"<Enter Participant 4>"},null,null,null,null,null,null,null,null,null,null,null,null,null,null,null,null,null,"pts",0,1,"","",0,null,"","","","","","","","","","","","","","","",""]
[{"$f":"'Week 1'!A15","v":"<Enter Participant 5>"},null,null,null,null,null,null,null,null,null,null,null,null,null,null,null,null,null,"pts",0,1,"","",0,null,"","","","","","","","","","","","","","","",""]
[{"$f":"'Week 1'!A16","v":"<Enter Participant 6>"},null,null,null,null,null,null,null,null,null,null,null,null,null,null,null,null,null,"pts",0,1,"","",0,null,"","","","","","","","","","","","","","","",""]
[{"$f":"'Week 1'!A17","v":"<Enter Participant 7>"},null,null,null,null,null,null,null,null,null,null,null,null,null,null,null,null,null,"pts",0,1,"","",0,null,"","","","","","","","","","","","","","","",""]
[{"$f":"'Week 1'!A18","v":"<Enter Participant 8>"},null,null,null,null,null,null,null,null,null,null,null,null,null,null,null,null,null,"pts",0,1,"","",0,null,"","","","","","","","","","","","","","","",""]
[{"$f":"'Week 1'!A19","v":"<Enter Participant 9>"},null,null,null,null,null,null,null,null,null,null,null,null,null,null,null,null,null,"pts",0,1,"","",0,null,"","","","","","","","","","","","","","","",""]
[{"$f":"'Week 1'!A20","v":"<Enter Participant 10>"},null,null,null,null,null,null,null,null,null,null,null,null,null,null,null,null,null,"pts",0,1,"","",0,null,"","","","","","","","","","","","","","","",""]
[{"$f":"'Week 1'!A21","v":"<Enter Participant 11>"},null,null,null,null,null,null,null,null,null,null,null,null,null,null,null,null,null,"pts",0,1,"","",0,null,"","","","","","","","","","","","","","","",""]
[{"$f":"'Week 1'!A22","v":"<Enter Participant 12>"},null,null,null,null,null,null,null,null,null,null,null,null,null,null,null,null,null,"pts",0,1,"","",0,null,"","","","","","","","","","","","","","","",""]
[{"$f":"'Week 1'!A23","v":"<Enter Participant 13>"},null,null,null,null,null,null,null,null,null,null,null,null,null,null,null,null,null,"pts",0,1,"","",0,null,"","","","","","","","","","","","","","","",""]
[{"$f":"'Week 1'!A24","v":"<Enter Participant 14>"},null,null,null,null,null,null,null,null,null,null,null,null,null,null,null,null,null,"pts",0,1,"","",0,null,"","","","","","","","","","","","","","","",""]
[{"$f":"'Week 1'!A25","v":"<Enter Participant 15>"},null,null,null,null,null,null,null,null,null,null,null,null,null,null,null,null,null,"pts",0,1,"","",0,null,"","","","","","","","","","","","","","","",""]
[{"$f":"'Week 1'!A26","v":"<Enter Participant 16>"},null,null,null,null,null,null,null,null,null,null,null,null,null,null,null,null,null,"pts",0,1,"","",0,null,"","","","","","","","","","","","","","","",{"$f":"IF(ISBLANK(Q$6),\"\",IF(Q26=Q$6,1,0))","v":""}]
[{"$f":"'Week 1'!A27","v":"<Enter Participant 17>"},null,null,null,null,null,null,null,null,null,null,null,null,null,null,null,null,null,"pts",0,1,"","",0,null,{"$f":"IF(ISBLANK(B$6),\"\",IF(B27=B$6,1,0))","v":""},"","","","","","","","","","","","","","",""]
[{"$f":"'Week 1'!A28","v":"<Enter Participant 18>"},null,null,null,null,null,null,null,null,null,null,null,null,null,null,null,null,null,"pts",0,1,"","",0,null,"","","","","","","","","","","","","","","",""]
[{"$f":"'Week 1'!A29","v":"<Enter Participant 19>"},null,null,null,null,null,null,null,null,null,null,null,null,null,null,null,null,null,"pts",0,1,"","",0,null,"","","","","","","","","","","","","","","",""]
[{"$f":"'Week 1'!A30","v":"<Enter Participant 20>"},null,null,null,null,null,null,null,null,null,null,null,null,null,null,null,null,null,"pts",0,1,"","",0,null,"","","","","","","","","","","","","","","",""]
[{"$f":"'Week 1'!A31","v":"<Enter Participant 21>"},null,null,null,null,null,null,null,null,null,null,null,null,null,null,null,null,null,"pts",0,1,"","",0,null,"","","","","","","","","","","","","","","",""]
[{"$f":"'Week 1'!A32","v":"<Enter Participant 22>"},null,null,null,null,null,null,null,null,null,null,null,null,null,null,null,null,null,"pts",0,1,"","",0,null,"","","","","","","","","","","","","","","",""]
[{"$f":"'Week 1'!A33","v":"<Enter Participant 23>"},null,null,null,null,null,null,null,null,null,null,null,null,null,null,null,null,null,"pts",0,1,"","",0,null,"","","","","","","","","","","","","","","",""]
[{"$f":"'Week 1'!A34","v":"<Enter Participant 24>"},null,null,null,null,null,null,null,null,null,null,null,null,null,null,null,null,null,"pts",0,1,"","",0,null,"","","","","","","","","","","","","","","",""]
[{"$f":"'Week 1'!A35","v":"<Enter Participant 25>"},null,null,null,null,null,null,null,null,null,null,null,null,null,null,null,null,null,"pts",0,1,"","",0,null,"","","","","","","","","","","","","","","",""]
[{"$f":"'Week 1'!A36","v":"<Enter Participant 26>"},null,null,null,null,null,null,null,null,null,null,null,null,null,null,null,null,null,"pts",0,1,"","",0,null,"","","","","","","","","","","","","","","",""]
[{"$f":"'Week 1'!A37","v":"<Enter Participant 27>"},null,null,null,null,null,null,null,null,null,null,null,null,null,null,null,null,null,"pts",0,1,"","",0,null,"","","","","","","","","","","","","","","",""]
[{"$f":"'Week 1'!A38","v":"<Enter Participant 28>"},null,null,null,null,null,null,null,null,null,null,null,null,null,null,null,null,null,"pts",0,1,"","",0,null,"","","","","","","","","","","","","","","",""]
[{"$f":"'Week 1'!A39","v":"<Enter Participant 29>"},null,null,null,null,null,null,null,null,null,null,null,null,null,null,null,null,null,"pts",0,1,"","",0,null,"","","","","","","","","","","","","","","",""]
[{"$f":"'Week 1'!A40","v":"<Enter Participant 30>"},null,null,null,null,null,null,null,null,null,null,null,null,null,null,null,null,null,"pts",0,1,"","",0,null,"","","","","","","","","","","","","","","",""]
[{"$f":"'Week 1'!A41","v":"<Enter Participant 31>"},null,null,null,null,null,null,null,null,null,null,null,null,null,null,null,null,null,"pts",0,1,"","",0,null,"","","","","","","","","","","","","","","",""]
[{"$f":"'Week 1'!A42","v":"<Enter Participant 32>"},null,null,null,null,null,null,null,null,null,null,null,null,null,null,null,null,null,"pts",0,1,"","",0,null,"","","","","","","","","","","","","","","",""]
[{"$f":"'Week 1'!A43","v":"<Enter Participant 33>"},null,null,null,null,null,null,null,null,null,null,null,null,null,null,null,null,null,"pts",{"$f":"IF(SUM(Z43:AO43)=0,0,SUM(Z43:AO43))","v":0},1,"","",{"$f":"VLOOKUP(A43,CUMULATIVE_TABLE,X$1,FALSE)","v":0},null,"","","","","","","","","","","","","","","",""]
[{"$f":"'Week 1'!A44","v":"<Enter Participant 34>"},null,null,null,null,null,null,null,null,null,null,null,null,null,null,null,null,null,"pts",0,1,"","",0,null,{"$f":"IF(ISBLANK(B$6),\"\",IF(B44=B$6,1,0))","v":""},"","","","","","","","","","","","","","",""]
[{"$f":"'Week 1'!A45","v":"<Enter Participant 35>"},null,null,null,null,null,null,null,null,null,null,null,null,null,null,null,null,null,"pts",0,1,"","",0,null,"","","","","","","","","","","","","","","",""]
[{"$f":"'Week 1'!A46","v":"<Enter Participant 36>"},null,null,null,null,null,null,null,null,null,null,null,null,null,null,null,null,null,"pts",0,1,"","",0,null,"","","","","","","","","","","","","","","",""]
[{"$f":"'Week 1'!A47","v":"<Enter Participant 37>"},null,null,null,null,null,null,null,null,null,null,null,null,null,null,null,null,null,"pts",0,1,"","",0,null,"","","","","","","","","","","","","","","",""]
[{"$f":"'Week 1'!A48","v":"<Enter Participant 38>"},null,null,null,null,null,null,null,null,null,null,null,null,null,null,null,null,null,"pts",0,1,"","",0,null,"","","","","","","","","","","","","","","",""]
[{"$f":"'Week 1'!A49","v":"<Enter Participant 39>"},null,null,null,null,null,null,null,null,null,null,null,null,null,null,null,null,null,"pts",0,1,"","",0,null,"","","","","","","","","","","","","","","",""]
[{"$f":"'Week 1'!A50","v":"<Enter Participant 40>"},null,null,null,null,null,null,null,null,null,null,null,null,null,null,null,null,null,"pts",0,1,"","",0,null,"","","","","","","","","","","","","","","",""]
[{"$f":"'Week 1'!A51","v":"<Enter Participant 41>"},null,null,null,null,null,null,null,null,null,null,null,null,null,null,null,null,null,"pts",0,1,"","",0,null,"","","","","","","","","","","","","","","",""]
[{"$f":"'Week 1'!A52","v":"<Enter Participant 42>"},null,null,null,null,null,null,null,null,null,null,null,null,null,null,null,null,null,"pts",0,1,"","",0,null,"","","","","","","","","","","","","","","",""]
[{"$f":"'Week 1'!A53","v":"<Enter Participant 43>"},null,null,null,null,null,null,null,null,null,null,null,null,null,null,null,null,null,"pts",0,1,"","",0,null,"","","","","","","","","","","","","","","",""]
[{"$f":"'Week 1'!A54","v":"<Enter Participant 44>"},null,null,null,null,null,null,null,null,null,null,null,null,null,null,null,null,null,"pts",0,1,"","",0,null,"","","","","","","","","","","","","","","",""]
[{"$f":"'Week 1'!A55","v":"<Enter Participant 45>"},null,null,null,null,null,null,null,null,null,null,null,null,null,null,null,null,null,"pts",0,1,"","",0,null,"","","","","","","","","","","","","","","",""]
[{"$f":"'Week 1'!A56","v":"<Enter Participant 46>"},null,null,null,null,null,null,null,null,null,null,null,null,null,null,null,null,null,"pts",0,1,"","",0,null,"","","","","","","","","","","","","","","",""]
[{"$f":"'Week 1'!A57","v":"<Enter Participant 47>"},null,null,null,null,null,null,null,null,null,null,null,null,null,null,null,null,null,"pts",0,1,"","",0,null,"","","","","","","","","","","","","","","",""]
[{"$f":"'Week 1'!A58","v":"<Enter Participant 48>"},null,null,null,null,null,null,null,null,null,null,null,null,null,null,null,null,null,"pts",0,1,"","",0,null,"","","","","","","","","","","","","","","",""]
[{"$f":"'Week 1'!A59","v":"<Enter Participant 49>"},null,null,null,null,null,null,null,null,null,null,null,null,null,null,null,null,null,"pts",0,1,"","",0,null,"","","","","","","","","","","","","","","",""]
[{"$f":"'Week 1'!A60","v":"<Enter Participant 50>"},null,null,null,null,null,null,null,null,null,null,null,null,null,null,null,null,null,"pts",0,1,"","",0,null,"","","","","","","","","","","","","","","",""]
[{"$f":"'Week 1'!A61","v":"<Enter Participant 51>"},null,null,null,null,null,null,null,null,null,null,null,null,null,null,null,null,null,"pts",0,1,"","",0,null,{"$f":"IF(ISBLANK(B$6),\"\",IF(B61=B$6,1,0))","v":""},"","","","","","","","","","","","","","",""]
[{"$f":"'Week 1'!A62","v":"<Enter Participant 52>"},null,null,null,null,null,null,null,null,null,null,null,null,null,null,null,null,null,"pts",0,1,"","",0,null,"","","","","","","","","","","","","","","",""]
[{"$f":"'Week 1'!A63","v":"<Enter Participant 53>"},null,null,null,null,null,null,null,null,null,null,null,null,null,null,null,null,null,"pts",0,1,"","",0,null,"","","","","","","","","","","","","","","",""]
[{"$f":"'Week 1'!A64","v":"<Enter Participant 54>"},null,null,null,null,null,null,null,null,null,null,null,null,null,null,null,null,null,"pts",0,1,"","",0,null,"","","","","","","","","","","","","","","",""]
[{"$f":"'Week 1'!A65","v":"<Enter Participant 55>"},null,null,null,null,null,null,null,null,null,null,null,null,null,null,null,null,null,"pts",0,1,"","",0,null,"","","","","","","","","","","","","","","",""]
[{"$f":"'Week 1'!A66","v":"<Enter Participant 56>"},null,null,null,null,null,null,null,null,null,null,null,null,null,null,null,null,null,"pts",0,1,"","",0,null,"","","","","","","","","","","","","","","",""]
[{"$f":"'Week 1'!A67","v":"<Enter Participant 57>"},null,null,null,null,null,null,null,null,null,null,null,null,null,null,null,null,null,"pts",0,1,"","",0,null,"","","","","","","","","","","","","","","",""]
[{"$f":"'Week 1'!A68","v":"<Enter Participant 58>"},null,null,null,null,null,null,null,null,null,null,null,null,null,null,null,null,null,"pts",0,1,"","",0,null,"","","","","","","","","","","","","","","",""]
[{"$f":"'Week 1'!A69","v":"<Enter Participant 59>"},null,null,null,null,null,null,null,null,null,null,null,null,null,null,null,null,null,"pts",0,1,"","",0,null,"","","","","","","","","","","","","","","",""]
[{"$f":"'Week 1'!A70","v":"<Enter Participant 60>"},null,null,null,null,null,null,null,null,null,null,null,null,null,null,null,null,null,"pts",0,1,"","",0,null,"","","","","","","","","","","","","","","",""]
[{"$f":"'Week 1'!A71","v":"<Enter Participant 61>"},null,null,null,null,null,null,null,null,null,null,null,null,null,null,null,null,null,"pts",0,1,"","",0,null,"","","","","","","","","","","","","","","",""]
[{"$f":"'Week 1'!A72","v":"<Enter Participant 62>"},null,null,null,null,null,null,null,null,null,null,null,null,null,null,null,null,null,"pts",0,1,"","",0,null,"","","","","","","","","","","","","","","",""]
[{"$f":"'Week 1'!A73","v":"<Enter Participant 63>"},null,null,null,null,null,null,null,null,null,null,null,null,null,null,null,null,null,"pts",0,1,"","",0,null,"","","","","","","","","","","","","","","",""]
[{"$f":"'Week 1'!A74","v":"<Enter Participant 64>"},null,null,null,null,null,null,null,null,null,null,null,null,null,null,null,null,null,"pts",0,1,"","",0,null,"","","","","","","","","","","","","","","",""]
[{"$f":"'Week 1'!A75","v":"<Enter Participant 65>"},null,null,null,null,null,null,null,null,null,null,null,null,null,null,null,null,null,"pts",0,{"$f":"IF(ISERROR(RANK(T75,$T$11:$T$85)),\"\",RANK(T75,$T$11:$T$85))","v":1},{"$f":"IF(ISBLANK(R75),\"\",IF(U75=1,ABS(R75-R$6),\"\"))","v":""},{"$f":"IF(ISERROR(RANK(V75,$V$11:$V$85,1)),\"\",RANK(V75,$V$11:$V$85,1))","v":""},{"$f":"VLOOKUP(A75,CUMULATIVE_TABLE,X$1,FALSE)","v":0},null,"","","","","","","","","","","","","","","",""]
[{"$f":"'Week 1'!A76","v":"<Enter Participant 66>"},null,null,null,null,null,null,null,null,null,null,null,null,null,null,null,null,null,"pts",0,1,"","",0,null,"","","","","","","","","","","","","","","",""]
[{"$f":"'Week 1'!A77","v":"<Enter Participant 67>"},null,null,null,null,null,null,null,null,null,null,null,null,null,null,null,null,null,"pts",0,1,"","",0,null,"","","","","","","","","","","","","","","",""]
[{"$f":"'Week 1'!A78","v":"<Enter Participant 68>"},null,null,null,null,null,null,null,null,null,null,null,null,null,null,null,null,null,"pts",0,1,"","",0,null,{"$f":"IF(ISBLANK(B$6),\"\",IF(B78=B$6,1,0))","v":""},"","","","","","","","","","","","","","",""]
[{"$f":"'Week 1'!A79","v":"<Enter Participant 69>"},null,null,null,null,null,null,null,null,null,null,null,null,null,null,null,null,null,"pts",0,1,"","",0,null,"","","","","","","","","","","","","","","",""]
[{"$f":"'Week 1'!A80","v":"<Enter Participant 70>"},null,null,null,null,null,null,null,null,null,null,null,null,null,null,null,null,null,"pts",0,1,"","",0,null,"","","","","","","","","","","","","","","",""]
[{"$f":"'Week 1'!A81","v":"<Enter Participant 71>"},null,null,null,null,null,null,null,null,null,null,null,null,null,null,null,null,null,"pts",0,1,"","",0,null,"","","","","","","","","","","","","","","",""]
[{"$f":"'Week 1'!A82","v":"<Enter Participant 72>"},null,null,null,null,null,null,null,null,null,null,null,null,null,null,null,null,null,"pts",0,1,"","",0,null,"","","","","","","","","","","","","","","",""]
[{"$f":"'Week 1'!A83","v":"<Enter Participant 73>"},null,null,null,null,null,null,null,null,null,null,null,null,null,null,null,null,null,"pts",0,1,"","",0,null,"","","","","","","","","","","","","","","",""]
[{"$f":"'Week 1'!A84","v":"<Enter Participant 74>"},null,null,null,null,null,null,null,null,null,null,null,null,null,null,null,null,null,"pts",0,1,"","",0,null,"","","","","","","","","","","","","","","",""]
[{"$f":"'Week 1'!A85","v":"<Enter Participant 75>"},null,null,null,null,null,null,null,null,null,null,null,null,null,null,null,null,null,"pts",0,1,"","",0,null,"","","","","","","","","","","","","","","",""]
[{"$f":"'Week 1'!A86","v":"<Enter Participant 76>"},null,null,null,null,null,null,null,null,null,null,null,null,null,null,null,null,null,"pts",0,1,"","",0,null,"","","","","","","","","","","","","","","",""]
[{"$f":"'Week 1'!A87","v":"<Enter Participant 77>"},null,null,null,null,null,null,null,null,null,null,null,null,null,null,null,null,null,"pts",0,1,"","",0,null,"","","","","","","","","","","","","","","",""]
[{"$f":"'Week 1'!A88","v":"<Enter Participant 78>"},null,null,null,null,null,null,null,null,null,null,null,null,null,null,null,null,null,"pts",0,1,"","",0,null,"","","","","","","","","","","","","","","",""]
[{"$f":"'Week 1'!A89","v":"<Enter Participant 79>"},null,null,null,null,null,null,null,null,null,null,null,null,null,null,null,null,null,"pts",0,1,"","",0,null,"","","","","","","","","","","","","","","",""]
[{"$f":"'Week 1'!A90","v":"<Enter Participant 80>"},null,null,null,null,null,null,null,null,null,null,null,null,null,null,null,null,null,"pts",0,1,"","",0,null,"","","","","","","","","","","","","","","",""]
[{"$f":"'Week 1'!A91","v":"<Enter Participant 81>"},null,null,null,null,null,null,null,null,null,null,null,null,null,null,null,null,null,"pts",0,1,"","",0,null,"","","","","","","","","","","","","","","",""]
[{"$f":"'Week 1'!A92","v":"<Enter Participant 82>"},null,null,null,null,null,null,null,null,null,null,null,null,null,null,null,null,null,"pts",0,1,"","",0,null,"","","","","","","","","","","","","","","",""]
[{"$f":"'Week 1'!A93","v":"<Enter Participant 83>"},null,null,null,null,null,null,null,null,null,null,null,null,null,null,null,null,null,"pts",0,1,"","",0,null,"","","","","","","","","","","","","","","",""]
[{"$f":"'Week 1'!A94","v":"<Enter Participant 84>"},null,null,null,null,null,null,null,null,null,null,null,null,null,null,null,null,null,"pts",0,1,"","",0,null,{"$f":"IF(ISBLANK(B$6),\"\",IF(B94=B$6,1,0))","v":""},"","","","","","","","","","","","","","",""]
[{"$f":"'Week 1'!A95","v":"<Enter Participant 85>"},null,null,null,null,null,null,null,null,null,null,null,null,null,null,null,null,null,"pts",0,1,"","",0,null,"","","","","","","","","","","","","","","",""]
[{"$f":"'Week 1'!A96","v":"<Enter Participant 86>"},null,null,null,null,null,null,null,null,null,null,null,null,null,null,null,null,null,"pts",0,1,"","",0,null,"","","","","","","","","","","","","","","",""]
[{"$f":"'Week 1'!A97","v":"<Enter Participant 87>"},null,null,null,null,null,null,null,null,null,null,null,null,null,null,null,null,null,"pts",0,1,"","",0,null,"","","","","","","","","","","","","","","",""]
[{"$f":"'Week 1'!A98","v":"<Enter Participant 88>"},null,null,null,null,null,null,null,null,null,null,null,null,null,null,null,null,null,"pts",0,1,"","",0,null,"","","","","","","","","","","","","","","",""]
[{"$f":"'Week 1'!A99","v":"<Enter Participant 89>"},null,null,null,null,null,null,null,null,null,null,null,null,null,null,null,null,null,"pts",0,1,"","",0,null,"","","","","","","","","","","","","","","",""]
[{"$f":"'Week 1'!A100","v":"<Enter Participant 90>"},null,null,null,null,null,null,null,null,null,null,null,null,null,null,null,null,null,"pts",0,1,"","",0,null,"","","","","","","","","","","","","","","",""]
[{"$f":"'Week 1'!A101","v":"<Enter Participant 91>"},null,null,null,null,null,null,null,null,null,null,null,null,null,null,null,null,null,"pts",0,1,"","",0,null,"","","","","","","","","","","","","","","",""]
[{"$f":"'Week 1'!A102","v":"<Enter Participant 92>"},null,null,null,null,null,null,null,null,null,null,null,null,null,null,null,null,null,"pts",0,1,"","",0,null,"","","","","","","","","","","","","","","",""]
[{"$f":"'Week 1'!A103","v":"<Enter Participant 93>"},null,null,null,null,null,null,null,null,null,null,null,null,null,null,null,null,null,"pts",0,1,"","",0,null,"","","","","","","","","","","","","","","",""]
[{"$f":"'Week 1'!A104","v":"<Enter Participant 94>"},null,null,null,null,null,null,null,null,null,null,null,null,null,null,null,null,null,"pts",0,1,"","",0,null,"","","","","","","","","","","","","","","",""]
[{"$f":"'Week 1'!A105","v":"<Enter Participant 95>"},null,null,null,null,null,null,null,null,null,null,null,null,null,null,null,null,null,"pts",0,1,"","",0,null,"","","","","","","","","","","","","","","",""]
[{"$f":"'Week 1'!A106","v":"<Enter Participant 96>"},null,null,null,null,null,null,null,null,null,null,null,null,null,null,null,null,null,"pts",0,1,"","",0,null,"","","","","","","","","","","","","","","",""]
[{"$f":"'Week 1'!A107","v":"<Enter Participant 97>"},null,null,null,null,null,null,null,null,null,null,null,null,null,null,null,null,null,"pts",{"$f":"IF(SUM(Z107:AO107)=0,0,SUM(Z107:AO107))","v":0},1,"","",0,null,"","","","","","","","","","","","","","","",""]
[{"$f":"'Week 1'!A108","v":"<Enter Participant 98>"},null,null,null,null,null,null,null,null,null,null,null,null,null,null,null,null,null,"pts",0,1,"","",0,null,"","","","","","","","","","","","","","","",""]
[{"$f":"'Week 1'!A109","v":"<Enter Participant 99>"},null,null,null,null,null,null,null,null,null,null,null,null,null,null,null,null,null,"pts",0,1,"","",0,null,"","","","","","","","","","","","","","","",{"$f":"IF(ISBLANK(Q$6),\"\",IF(Q109=Q$6,1,0))","v":""}]
[{"$f":"'Week 1'!A110","v":"<Enter Participant 100>"},null,null,null,null,null,null,null,null,null,null,null,null,null,null,null,null,null,"pts",0,1,"","",0,null,{"$f":"IF(ISBLANK(B$6),\"\",IF(B110=B$6,1,0))","v":""},"","","","","","","","","","","","","","",""]

{"sheet":"Week 12","index":11,"n_rows":110,"n_cols":41,"rows_kept":110,"cut":false,"hidden":false,"merged":[[1,17,1,18],[1,19,3,23],[4,23,9,23],[9,17,9,18]]}
["Week Lookup Column Offset",2,3,4,5,6,7,8,9,10,11,12,13,14,15,16,17,null,null,null,null,null,null,{"$f":"MID(T2,FIND(\" \",T2)+1,2)*1+18","v":30}]
[null,"GAME 1","GAME 2","GAME 3","GAME 4","GAME 5","GAME 6","GAME 7","GAME 8","GAME 9","GAME 10","GAME 11","GAME 12","GAME 13","GAME 14","GAME 15","GAME 16","SCORE",null,"Week 12"]
["VISITOR",{"$f":"IF(VLOOKUP($T$2&\" Visitors\",SCHEDULE_TABLE,B$1,FALSE)=0,\"\",VLOOKUP($T$2&\" Visitors\",SCHEDULE_TABLE,B$1,FALSE))","v":"KC"},"CLE","NYJ","TB","CIN","JAX","GB","DET","TEN","STL","ARI","MIA","WAS","DAL","BAL","",null,"pts"]
[null,"at","at","at","at","at","at","at","at","at","at","at","at","at","at","at","at"]
["HOME",{"$f":"IF(VLOOKUP($T$2&\" Homes\",SCHEDULE_TABLE,B$1,FALSE)=0,\"\",VLOOKUP($T$2&\" Homes\",SCHEDULE_TABLE,B$1,FALSE))","v":"OAK"},"ATL","BUF","CHI","HOU","IND","MIN","NE","PHI","SD","SEA","DEN","SF","NYG","NO","",null,"pts",null,null,null,null,"TOTAL POINTS FOR YEAR"]
["WINNER",null,null,null,null,null,null,null,null,null,null,null,null,null,null,null,null,{"$f":"IF(R3+R5=0,\"\",R3+R5)","v":""},"pts"]
[null,{"$f":"B3","v":"KC"},"CLE","NYJ","TB","CIN","JAX","GB","DET","TEN","STL","ARI","MIA","WAS","DAL","BAL",""]
[null,{"$f":"B5","v":"OAK"},"ATL","BUF","CHI","HOU","IND","MIN","NE","PHI","SD","SEA","DEN","SF","NYG","NO",""]
[]
["NAME","PICKS","PICKS","PICKS","PICKS","PICKS","PICKS","PICKS","PICKS","PICKS","PICKS","PICKS","PICKS","PICKS","PICKS","PICKS","PICKS","TIE-BREAK",null,"PICK PTS","PTS RANK","ABS DIFF","TIE-BREAK"]
[{"$f":"'Week 1'!A11","v":"<Enter Participant 1>"},null,null,null,null,null,null,null,null,null,null,null,null,null,null,null,null,null,"pts",{"$f":"IF(SUM(Z11:AO11)=0,0,SUM(Z11:AO11))","v":0},{"$f":"IF(ISERROR(RANK(T11,$T$11:$T$85)),\"\",RANK(T11,$T$11:$T$85))","v":1},{"$f":"IF(ISBLANK(R11),\"\",IF(U11=1,ABS(R11-R$6),\"\"))","v":""},{"$f":"IF(ISERROR(RANK(V11,$V$11:$V$85,1)),\"\",RANK(V11,$V$11:$V$85,1))","v":""},{"$f":"VLOOKUP(A11,CUMULATIVE_TABLE,X$1,FALSE)","v":0},null,{"$f":"IF(ISBLANK(B$6),\"\",IF(B11=B$6,1,0))","v":""},"","","","","","","","","","","","","","",""]
[{"$f":"'Week 1'!A12","v":"<Enter Participant 2>"},null,null,null,null,null,null,null,null,null,null,null,null,null,null,null,null,null,"pts",0,1,"","",0,null,"","","","","","","","","","","","","","","",""]
[{"$f":"'Week 1'!A13","v":"<Enter Participant 3>"},null,null,null,null,null,null,null,null,null,null,null,null,null,null,null,null,null,"pts",0,1,"","",0,null,"","","","","","","","","","","","","","","",""]
[{"$f":"'Week 1'!A14","v":"<Enter Participant 4>"},null,null,null,null,null,null,null,null,null,null,null,null,null,null,null,null,null,"pts",0,1,"","",0,null,"","","","","","","","","","","","","","","",""]
[{"$f":"'Week 1'!A15","v":"<Enter Participant 5>"},null,null,null,null,null,null,null,null,null,null,null,null,null,null,null,null,null,"pts",0,1,"","",0,null,"","","","","","","","","","","","","","","",""]
[{"$f":"'Week 1'!A16","v":"<Enter Participant 6>"},null,null,null,null,null,null,null,null,null,null,null,null,null,null,null,null,null,"pts",0,1,"","",0,null,"","","","","","","","","","","","","","","",""]
[{"$f":"'Week 1'!A17","v":"<Enter Participant 7>"},null,null,null,null,null,null,null,null,null,null,null,null,null,null,null,null,null,"pts",0,1,"","",0,null,"","","","","","","","","","","","","","","",""]
[{"$f":"'Week 1'!A18","v":"<Enter Participant 8>"},null,null,null,null,null,null,null,null,null,null,null,null,null,null,null,null,null,"pts",0,1,"","",0,null,"","","","","","","","","","","","","","","",""]
[{"$f":"'Week 1'!A19","v":"<Enter Participant 9>"},null,null,null,null,null,null,null,null,null,null,null,null,null,null,null,null,null,"pts",0,1,"","",0,null,"","","","","","","","","","","","","","","",""]
[{"$f":"'Week 1'!A20","v":"<Enter Participant 10>"},null,null,null,null,null,null,null,null,null,null,null,null,null,null,null,null,null,"pts",0,1,"","",0,null,"","","","","","","","","","","","","","","",""]
[{"$f":"'Week 1'!A21","v":"<Enter Participant 11>"},null,null,null,null,null,null,null,null,null,null,null,null,null,null,null,null,null,"pts",0,1,"","",0,null,"","","","","","","","","","","","","","","",""]
[{"$f":"'Week 1'!A22","v":"<Enter Participant 12>"},null,null,null,null,null,null,null,null,null,null,null,null,null,null,null,null,null,"pts",0,1,"","",0,null,"","","","","","","","","","","","","","","",""]
[{"$f":"'Week 1'!A23","v":"<Enter Participant 13>"},null,null,null,null,null,null,null,null,null,null,null,null,null,null,null,null,null,"pts",0,1,"","",0,null,"","","","","","","","","","","","","","","",""]
[{"$f":"'Week 1'!A24","v":"<Enter Participant 14>"},null,null,null,null,null,null,null,null,null,null,null,null,null,null,null,null,null,"pts",0,1,"","",0,null,"","","","","","","","","","","","","","","",""]
[{"$f":"'Week 1'!A25","v":"<Enter Participant 15>"},null,null,null,null,null,null,null,null,null,null,null,null,null,null,null,null,null,"pts",0,1,"","",0,null,"","","","","","","","","","","","","","","",""]
[{"$f":"'Week 1'!A26","v":"<Enter Participant 16>"},null,null,null,null,null,null,null,null,null,null,null,null,null,null,null,null,null,"pts",0,1,"","",0,null,"","","","","","","","","","","","","","","",{"$f":"IF(ISBLANK(Q$6),\"\",IF(Q26=Q$6,1,0))","v":""}]
[{"$f":"'Week 1'!A27","v":"<Enter Participant 17>"},null,null,null,null,null,null,null,null,null,null,null,null,null,null,null,null,null,"pts",0,1,"","",0,null,{"$f":"IF(ISBLANK(B$6),\"\",IF(B27=B$6,1,0))","v":""},"","","","","","","","","","","","","","",""]
[{"$f":"'Week 1'!A28","v":"<Enter Participant 18>"},null,null,null,null,null,null,null,null,null,null,null,null,null,null,null,null,null,"pts",0,1,"","",0,null,"","","","","","","","","","","","","","","",""]
[{"$f":"'Week 1'!A29","v":"<Enter Participant 19>"},null,null,null,null,null,null,null,null,null,null,null,null,null,null,null,null,null,"pts",0,1,"","",0,null,"","","","","","","","","","","","","","","",""]
[{"$f":"'Week 1'!A30","v":"<Enter Participant 20>"},null,null,null,null,null,null,null,null,null,null,null,null,null,null,null,null,null,"pts",0,1,"","",0,null,"","","","","","","","","","","","","","","",""]
[{"$f":"'Week 1'!A31","v":"<Enter Participant 21>"},null,null,null,null,null,null,null,null,null,null,null,null,null,null,null,null,null,"pts",0,1,"","",0,null,"","","","","","","","","","","","","","","",""]
[{"$f":"'Week 1'!A32","v":"<Enter Participant 22>"},null,null,null,null,null,null,null,null,null,null,null,null,null,null,null,null,null,"pts",0,1,"","",0,null,"","","","","","","","","","","","","","","",""]
[{"$f":"'Week 1'!A33","v":"<Enter Participant 23>"},null,null,null,null,null,null,null,null,null,null,null,null,null,null,null,null,null,"pts",0,1,"","",0,null,"","","","","","","","","","","","","","","",""]
[{"$f":"'Week 1'!A34","v":"<Enter Participant 24>"},null,null,null,null,null,null,null,null,null,null,null,null,null,null,null,null,null,"pts",0,1,"","",0,null,"","","","","","","","","","","","","","","",""]
[{"$f":"'Week 1'!A35","v":"<Enter Participant 25>"},null,null,null,null,null,null,null,null,null,null,null,null,null,null,null,null,null,"pts",0,1,"","",0,null,"","","","","","","","","","","","","","","",""]
[{"$f":"'Week 1'!A36","v":"<Enter Participant 26>"},null,null,null,null,null,null,null,null,null,null,null,null,null,null,null,null,null,"pts",0,1,"","",0,null,"","","","","","","","","","","","","","","",""]
[{"$f":"'Week 1'!A37","v":"<Enter Participant 27>"},null,null,null,null,null,null,null,null,null,null,null,null,null,null,null,null,null,"pts",0,1,"","",0,null,"","","","","","","","","","","","","","","",""]
[{"$f":"'Week 1'!A38","v":"<Enter Participant 28>"},null,null,null,null,null,null,null,null,null,null,null,null,null,null,null,null,null,"pts",0,1,"","",0,null,"","","","","","","","","","","","","","","",""]
[{"$f":"'Week 1'!A39","v":"<Enter Participant 29>"},null,null,null,null,null,null,null,null,null,null,null,null,null,null,null,null,null,"pts",0,1,"","",0,null,"","","","","","","","","","","","","","","",""]
[{"$f":"'Week 1'!A40","v":"<Enter Participant 30>"},null,null,null,null,null,null,null,null,null,null,null,null,null,null,null,null,null,"pts",0,1,"","",0,null,"","","","","","","","","","","","","","","",""]
[{"$f":"'Week 1'!A41","v":"<Enter Participant 31>"},null,null,null,null,null,null,null,null,null,null,null,null,null,null,null,null,null,"pts",0,1,"","",0,null,"","","","","","","","","","","","","","","",""]
[{"$f":"'Week 1'!A42","v":"<Enter Participant 32>"},null,null,null,null,null,null,null,null,null,null,null,null,null,null,null,null,null,"pts",0,1,"","",0,null,"","","","","","","","","","","","","","","",""]
[{"$f":"'Week 1'!A43","v":"<Enter Participant 33>"},null,null,null,null,null,null,null,null,null,null,null,null,null,null,null,null,null,"pts",{"$f":"IF(SUM(Z43:AO43)=0,0,SUM(Z43:AO43))","v":0},1,"","",{"$f":"VLOOKUP(A43,CUMULATIVE_TABLE,X$1,FALSE)","v":0},null,"","","","","","","","","","","","","","","",""]
[{"$f":"'Week 1'!A44","v":"<Enter Participant 34>"},null,null,null,null,null,null,null,null,null,null,null,null,null,null,null,null,null,"pts",0,1,"","",0,null,{"$f":"IF(ISBLANK(B$6),\"\",IF(B44=B$6,1,0))","v":""},"","","","","","","","","","","","","","",""]
[{"$f":"'Week 1'!A45","v":"<Enter Participant 35>"},null,null,null,null,null,null,null,null,null,null,null,null,null,null,null,null,null,"pts",0,1,"","",0,null,"","","","","","","","","","","","","","","",""]
[{"$f":"'Week 1'!A46","v":"<Enter Participant 36>"},null,null,null,null,null,null,null,null,null,null,null,null,null,null,null,null,null,"pts",0,1,"","",0,null,"","","","","","","","","","","","","","","",""]
[{"$f":"'Week 1'!A47","v":"<Enter Participant 37>"},null,null,null,null,null,null,null,null,null,null,null,null,null,null,null,null,null,"pts",0,1,"","",0,null,"","","","","","","","","","","","","","","",""]
[{"$f":"'Week 1'!A48","v":"<Enter Participant 38>"},null,null,null,null,null,null,null,null,null,null,null,null,null,null,null,null,null,"pts",0,1,"","",0,null,"","","","","","","","","","","","","","","",""]
[{"$f":"'Week 1'!A49","v":"<Enter Participant 39>"},null,null,null,null,null,null,null,null,null,null,null,null,null,null,null,null,null,"pts",0,1,"","",0,null,"","","","","","","","","","","","","","","",""]
[{"$f":"'Week 1'!A50","v":"<Enter Participant 40>"},null,null,null,null,null,null,null,null,null,null,null,null,null,null,null,null,null,"pts",0,1,"","",0,null,"","","","","","","","","","","","","","","",""]
[{"$f":"'Week 1'!A51","v":"<Enter Participant 41>"},null,null,null,null,null,null,null,null,null,null,null,null,null,null,null,null,null,"pts",0,1,"","",0,null,"","","","","","","","","","","","","","","",""]
[{"$f":"'Week 1'!A52","v":"<Enter Participant 42>"},null,null,null,null,null,null,null,null,null,null,null,null,null,null,null,null,null,"pts",0,1,"","",0,null,"","","","","","","","","","","","","","","",""]
[{"$f":"'Week 1'!A53","v":"<Enter Participant 43>"},null,null,null,null,null,null,null,null,null,null,null,null,null,null,null,null,null,"pts",0,1,"","",0,null,"","","","","","","","","","","","","","","",""]
[{"$f":"'Week 1'!A54","v":"<Enter Participant 44>"},null,null,null,null,null,null,null,null,null,null,null,null,null,null,null,null,null,"pts",0,1,"","",0,null,"","","","","","","","","","","","","","","",""]
[{"$f":"'Week 1'!A55","v":"<Enter Participant 45>"},null,null,null,null,null,null,null,null,null,null,null,null,null,null,null,null,null,"pts",0,1,"","",0,null,"","","","","","","","","","","","","","","",""]
[{"$f":"'Week 1'!A56","v":"<Enter Participant 46>"},null,null,null,null,null,null,null,null,null,null,null,null,null,null,null,null,null,"pts",0,1,"","",0,null,"","","","","","","","","","","","","","","",""]
[{"$f":"'Week 1'!A57","v":"<Enter Participant 47>"},null,null,null,null,null,null,null,null,null,null,null,null,null,null,null,null,null,"pts",0,1,"","",0,null,"","","","","","","","","","","","","","","",""]
[{"$f":"'Week 1'!A58","v":"<Enter Participant 48>"},null,null,null,null,null,null,null,null,null,null,null,null,null,null,null,null,null,"pts",0,1,"","",0,null,"","","","","","","","","","","","","","","",""]
[{"$f":"'Week 1'!A59","v":"<Enter Participant 49>"},null,null,null,null,null,null,null,null,null,null,null,null,null,null,null,null,null,"pts",0,1,"","",0,null,"","","","","","","","","","","","","","","",""]
[{"$f":"'Week 1'!A60","v":"<Enter Participant 50>"},null,null,null,null,null,null,null,null,null,null,null,null,null,null,null,null,null,"pts",0,1,"","",0,null,"","","","","","","","","","","","","","","",""]
[{"$f":"'Week 1'!A61","v":"<Enter Participant 51>"},null,null,null,null,null,null,null,null,null,null,null,null,null,null,null,null,null,"pts",0,1,"","",0,null,{"$f":"IF(ISBLANK(B$6),\"\",IF(B61=B$6,1,0))","v":""},"","","","","","","","","","","","","","",""]
[{"$f":"'Week 1'!A62","v":"<Enter Participant 52>"},null,null,null,null,null,null,null,null,null,null,null,null,null,null,null,null,null,"pts",0,1,"","",0,null,"","","","","","","","","","","","","","","",""]
[{"$f":"'Week 1'!A63","v":"<Enter Participant 53>"},null,null,null,null,null,null,null,null,null,null,null,null,null,null,null,null,null,"pts",0,1,"","",0,null,"","","","","","","","","","","","","","","",""]
[{"$f":"'Week 1'!A64","v":"<Enter Participant 54>"},null,null,null,null,null,null,null,null,null,null,null,null,null,null,null,null,null,"pts",0,1,"","",0,null,"","","","","","","","","","","","","","","",""]
[{"$f":"'Week 1'!A65","v":"<Enter Participant 55>"},null,null,null,null,null,null,null,null,null,null,null,null,null,null,null,null,null,"pts",0,1,"","",0,null,"","","","","","","","","","","","","","","",""]
[{"$f":"'Week 1'!A66","v":"<Enter Participant 56>"},null,null,null,null,null,null,null,null,null,null,null,null,null,null,null,null,null,"pts",0,1,"","",0,null,"","","","","","","","","","","","","","","",""]
[{"$f":"'Week 1'!A67","v":"<Enter Participant 57>"},null,null,null,null,null,null,null,null,null,null,null,null,null,null,null,null,null,"pts",0,1,"","",0,null,"","","","","","","","","","","","","","","",""]
[{"$f":"'Week 1'!A68","v":"<Enter Participant 58>"},null,null,null,null,null,null,null,null,null,null,null,null,null,null,null,null,null,"pts",0,1,"","",0,null,"","","","","","","","","","","","","","","",""]
[{"$f":"'Week 1'!A69","v":"<Enter Participant 59>"},null,null,null,null,null,null,null,null,null,null,null,null,null,null,null,null,null,"pts",0,1,"","",0,null,"","","","","","","","","","","","","","","",""]
[{"$f":"'Week 1'!A70","v":"<Enter Participant 60>"},null,null,null,null,null,null,null,null,null,null,null,null,null,null,null,null,null,"pts",0,1,"","",0,null,"","","","","","","","","","","","","","","",""]
[{"$f":"'Week 1'!A71","v":"<Enter Participant 61>"},null,null,null,null,null,null,null,null,null,null,null,null,null,null,null,null,null,"pts",0,1,"","",0,null,"","","","","","","","","","","","","","","",""]
[{"$f":"'Week 1'!A72","v":"<Enter Participant 62>"},null,null,null,null,null,null,null,null,null,null,null,null,null,null,null,null,null,"pts",0,1,"","",0,null,"","","","","","","","","","","","","","","",""]
[{"$f":"'Week 1'!A73","v":"<Enter Participant 63>"},null,null,null,null,null,null,null,null,null,null,null,null,null,null,null,null,null,"pts",0,1,"","",0,null,"","","","","","","","","","","","","","","",""]
[{"$f":"'Week 1'!A74","v":"<Enter Participant 64>"},null,null,null,null,null,null,null,null,null,null,null,null,null,null,null,null,null,"pts",0,1,"","",0,null,"","","","","","","","","","","","","","","",""]
[{"$f":"'Week 1'!A75","v":"<Enter Participant 65>"},null,null,null,null,null,null,null,null,null,null,null,null,null,null,null,null,null,"pts",0,{"$f":"IF(ISERROR(RANK(T75,$T$11:$T$85)),\"\",RANK(T75,$T$11:$T$85))","v":1},{"$f":"IF(ISBLANK(R75),\"\",IF(U75=1,ABS(R75-R$6),\"\"))","v":""},{"$f":"IF(ISERROR(RANK(V75,$V$11:$V$85,1)),\"\",RANK(V75,$V$11:$V$85,1))","v":""},{"$f":"VLOOKUP(A75,CUMULATIVE_TABLE,X$1,FALSE)","v":0},null,"","","","","","","","","","","","","","","",""]
[{"$f":"'Week 1'!A76","v":"<Enter Participant 66>"},null,null,null,null,null,null,null,null,null,null,null,null,null,null,null,null,null,"pts",0,1,"","",0,null,"","","","","","","","","","","","","","","",""]
[{"$f":"'Week 1'!A77","v":"<Enter Participant 67>"},null,null,null,null,null,null,null,null,null,null,null,null,null,null,null,null,null,"pts",0,1,"","",0,null,"","","","","","","","","","","","","","","",""]
[{"$f":"'Week 1'!A78","v":"<Enter Participant 68>"},null,null,null,null,null,null,null,null,null,null,null,null,null,null,null,null,null,"pts",0,1,"","",0,null,{"$f":"IF(ISBLANK(B$6),\"\",IF(B78=B$6,1,0))","v":""},"","","","","","","","","","","","","","",""]
[{"$f":"'Week 1'!A79","v":"<Enter Participant 69>"},null,null,null,null,null,null,null,null,null,null,null,null,null,null,null,null,null,"pts",0,1,"","",0,null,"","","","","","","","","","","","","","","",""]
[{"$f":"'Week 1'!A80","v":"<Enter Participant 70>"},null,null,null,null,null,null,null,null,null,null,null,null,null,null,null,null,null,"pts",0,1,"","",0,null,"","","","","","","","","","","","","","","",""]
[{"$f":"'Week 1'!A81","v":"<Enter Participant 71>"},null,null,null,null,null,null,null,null,null,null,null,null,null,null,null,null,null,"pts",0,1,"","",0,null,"","","","","","","","","","","","","","","",""]
[{"$f":"'Week 1'!A82","v":"<Enter Participant 72>"},null,null,null,null,null,null,null,null,null,null,null,null,null,null,null,null,null,"pts",0,1,"","",0,null,"","","","","","","","","","","","","","","",""]
[{"$f":"'Week 1'!A83","v":"<Enter Participant 73>"},null,null,null,null,null,null,null,null,null,null,null,null,null,null,null,null,null,"pts",0,1,"","",0,null,"","","","","","","","","","","","","","","",""]
[{"$f":"'Week 1'!A84","v":"<Enter Participant 74>"},null,null,null,null,null,null,null,null,null,null,null,null,null,null,null,null,null,"pts",0,1,"","",0,null,"","","","","","","","","","","","","","","",""]
[{"$f":"'Week 1'!A85","v":"<Enter Participant 75>"},null,null,null,null,null,null,null,null,null,null,null,null,null,null,null,null,null,"pts",0,1,"","",0,null,"","","","","","","","","","","","","","","",""]
[{"$f":"'Week 1'!A86","v":"<Enter Participant 76>"},null,null,null,null,null,null,null,null,null,null,null,null,null,null,null,null,null,"pts",0,1,"","",0,null,"","","","","","","","","","","","","","","",""]
[{"$f":"'Week 1'!A87","v":"<Enter Participant 77>"},null,null,null,null,null,null,null,null,null,null,null,null,null,null,null,null,null,"pts",0,1,"","",0,null,"","","","","","","","","","","","","","","",""]
[{"$f":"'Week 1'!A88","v":"<Enter Participant 78>"},null,null,null,null,null,null,null,null,null,null,null,null,null,null,null,null,null,"pts",0,1,"","",0,null,"","","","","","","","","","","","","","","",""]
[{"$f":"'Week 1'!A89","v":"<Enter Participant 79>"},null,null,null,null,null,null,null,null,null,null,null,null,null,null,null,null,null,"pts",0,1,"","",0,null,"","","","","","","","","","","","","","","",""]
[{"$f":"'Week 1'!A90","v":"<Enter Participant 80>"},null,null,null,null,null,null,null,null,null,null,null,null,null,null,null,null,null,"pts",0,1,"","",0,null,"","","","","","","","","","","","","","","",""]
[{"$f":"'Week 1'!A91","v":"<Enter Participant 81>"},null,null,null,null,null,null,null,null,null,null,null,null,null,null,null,null,null,"pts",0,1,"","",0,null,"","","","","","","","","","","","","","","",""]
[{"$f":"'Week 1'!A92","v":"<Enter Participant 82>"},null,null,null,null,null,null,null,null,null,null,null,null,null,null,null,null,null,"pts",0,1,"","",0,null,"","","","","","","","","","","","","","","",""]
[{"$f":"'Week 1'!A93","v":"<Enter Participant 83>"},null,null,null,null,null,null,null,null,null,null,null,null,null,null,null,null,null,"pts",0,1,"","",0,null,"","","","","","","","","","","","","","","",""]
[{"$f":"'Week 1'!A94","v":"<Enter Participant 84>"},null,null,null,null,null,null,null,null,null,null,null,null,null,null,null,null,null,"pts",0,1,"","",0,null,{"$f":"IF(ISBLANK(B$6),\"\",IF(B94=B$6,1,0))","v":""},"","","","","","","","","","","","","","",""]
[{"$f":"'Week 1'!A95","v":"<Enter Participant 85>"},null,null,null,null,null,null,null,null,null,null,null,null,null,null,null,null,null,"pts",0,1,"","",0,null,"","","","","","","","","","","","","","","",""]
[{"$f":"'Week 1'!A96","v":"<Enter Participant 86>"},null,null,null,null,null,null,null,null,null,null,null,null,null,null,null,null,null,"pts",0,1,"","",0,null,"","","","","","","","","","","","","","","",""]
[{"$f":"'Week 1'!A97","v":"<Enter Participant 87>"},null,null,null,null,null,null,null,null,null,null,null,null,null,null,null,null,null,"pts",0,1,"","",0,null,"","","","","","","","","","","","","","","",""]
[{"$f":"'Week 1'!A98","v":"<Enter Participant 88>"},null,null,null,null,null,null,null,null,null,null,null,null,null,null,null,null,null,"pts",0,1,"","",0,null,"","","","","","","","","","","","","","","",""]
[{"$f":"'Week 1'!A99","v":"<Enter Participant 89>"},null,null,null,null,null,null,null,null,null,null,null,null,null,null,null,null,null,"pts",0,1,"","",0,null,"","","","","","","","","","","","","","","",""]
[{"$f":"'Week 1'!A100","v":"<Enter Participant 90>"},null,null,null,null,null,null,null,null,null,null,null,null,null,null,null,null,null,"pts",0,1,"","",0,null,"","","","","","","","","","","","","","","",""]
[{"$f":"'Week 1'!A101","v":"<Enter Participant 91>"},null,null,null,null,null,null,null,null,null,null,null,null,null,null,null,null,null,"pts",0,1,"","",0,null,"","","","","","","","","","","","","","","",""]
[{"$f":"'Week 1'!A102","v":"<Enter Participant 92>"},null,null,null,null,null,null,null,null,null,null,null,null,null,null,null,null,null,"pts",0,1,"","",0,null,"","","","","","","","","","","","","","","",""]
[{"$f":"'Week 1'!A103","v":"<Enter Participant 93>"},null,null,null,null,null,null,null,null,null,null,null,null,null,null,null,null,null,"pts",0,1,"","",0,null,"","","","","","","","","","","","","","","",""]
[{"$f":"'Week 1'!A104","v":"<Enter Participant 94>"},null,null,null,null,null,null,null,null,null,null,null,null,null,null,null,null,null,"pts",0,1,"","",0,null,"","","","","","","","","","","","","","","",""]
[{"$f":"'Week 1'!A105","v":"<Enter Participant 95>"},null,null,null,null,null,null,null,null,null,null,null,null,null,null,null,null,null,"pts",0,1,"","",0,null,"","","","","","","","","","","","","","","",""]
[{"$f":"'Week 1'!A106","v":"<Enter Participant 96>"},null,null,null,null,null,null,null,null,null,null,null,null,null,null,null,null,null,"pts",0,1,"","",0,null,"","","","","","","","","","","","","","","",""]
[{"$f":"'Week 1'!A107","v":"<Enter Participant 97>"},null,null,null,null,null,null,null,null,null,null,null,null,null,null,null,null,null,"pts",{"$f":"IF(SUM(Z107:AO107)=0,0,SUM(Z107:AO107))","v":0},1,"","",0,null,"","","","","","","","","","","","","","","",""]
[{"$f":"'Week 1'!A108","v":"<Enter Participant 98>"},null,null,null,null,null,null,null,null,null,null,null,null,null,null,null,null,null,"pts",0,1,"","",0,null,"","","","","","","","","","","","","","","",""]
[{"$f":"'Week 1'!A109","v":"<Enter Participant 99>"},null,null,null,null,null,null,null,null,null,null,null,null,null,null,null,null,null,"pts",0,1,"","",0,null,"","","","","","","","","","","","","","","",{"$f":"IF(ISBLANK(Q$6),\"\",IF(Q109=Q$6,1,0))","v":""}]
[{"$f":"'Week 1'!A110","v":"<Enter Participant 100>"},null,null,null,null,null,null,null,null,null,null,null,null,null,null,null,null,null,"pts",0,1,"","",0,null,{"$f":"IF(ISBLANK(B$6),\"\",IF(B110=B$6,1,0))","v":""},"","","","","","","","","","","","","","",""]

{"sheet":"Week 13","index":12,"n_rows":110,"n_cols":41,"rows_kept":110,"cut":false,"hidden":false,"merged":[[1,17,1,18],[1,19,3,23],[4,23,9,23],[9,17,9,18]]}
["Week Lookup Column Offset",2,3,4,5,6,7,8,9,10,11,12,13,14,15,16,17,null,null,null,null,null,null,{"$f":"MID(T2,FIND(\" \",T2)+1,2)*1+18","v":31}]
[null,"GAME 1","GAME 2","GAME 3","GAME 4","GAME 5","GAME 6","GAME 7","GAME 8","GAME 9","GAME 10","GAME 11","GAME 12","GAME 13","GAME 14","GAME 15","GAME 16","SCORE",null,"Week 13"]
["VISITOR",{"$f":"IF(VLOOKUP($T$2&\" Visitors\",SCHEDULE_TABLE,B$1,FALSE)=0,\"\",VLOOKUP($T$2&\" Visitors\",SCHEDULE_TABLE,B$1,FALSE))","v":"CHI"},"PHI","SEA","SD","CLE","TEN","WAS","NYG","CAR","NO","OAK","CIN","ARI","NE","DEN","MIA",null,"pts"]
[null,"at","at","at","at","at","at","at","at","at","at","at","at","at","at","at","at"]
["HOME",{"$f":"IF(VLOOKUP($T$2&\" Homes\",SCHEDULE_TABLE,B$1,FALSE)=0,\"\",VLOOKUP($T$2&\" Homes\",SCHEDULE_TABLE,B$1,FALSE))","v":"DET"},"DAL","SF","BAL","BUF","HOU","IND","JAX","MIN","PIT","STL","TB","ATL","GB","KC","NYJ",null,"pts",null,null,null,null,"TOTAL POINTS FOR YEAR"]
["WINNER",null,null,null,null,null,null,null,null,null,null,null,null,null,null,null,null,{"$f":"IF(R3+R5=0,\"\",R3+R5)","v":""},"pts"]
[null,{"$f":"B3","v":"CHI"},"PHI","SEA","SD","CLE","TEN","WAS","NYG","CAR","NO","OAK","CIN","ARI","NE","DEN","MIA"]
[null,{"$f":"B5","v":"DET"},"DAL","SF","BAL","BUF","HOU","IND","JAX","MIN","PIT","STL","TB","ATL","GB","KC","NYJ"]
[]
["NAME","PICKS","PICKS","PICKS","PICKS","PICKS","PICKS","PICKS","PICKS","PICKS","PICKS","PICKS","PICKS","PICKS","PICKS","PICKS","PICKS","TIE-BREAK",null,"PICK PTS","PTS RANK","ABS DIFF","TIE-BREAK"]
[{"$f":"'Week 1'!A11","v":"<Enter Participant 1>"},null,null,null,null,null,null,null,null,null,null,null,null,null,null,null,null,null,"pts",{"$f":"IF(SUM(Z11:AO11)=0,0,SUM(Z11:AO11))","v":0},{"$f":"IF(ISERROR(RANK(T11,$T$11:$T$85)),\"\",RANK(T11,$T$11:$T$85))","v":1},{"$f":"IF(ISBLANK(R11),\"\",IF(U11=1,ABS(R11-R$6),\"\"))","v":""},{"$f":"IF(ISERROR(RANK(V11,$V$11:$V$85,1)),\"\",RANK(V11,$V$11:$V$85,1))","v":""},{"$f":"VLOOKUP(A11,CUMULATIVE_TABLE,X$1,FALSE)","v":0},null,{"$f":"IF(ISBLANK(B$6),\"\",IF(B11=B$6,1,0))","v":""},"","","","","","","","","","","","","","",""]
[{"$f":"'Week 1'!A12","v":"<Enter Participant 2>"},null,null,null,null,null,null,null,null,null,null,null,null,null,null,null,null,null,"pts",0,1,"","",0,null,"","","","","","","","","","","","","","","",""]
[{"$f":"'Week 1'!A13","v":"<Enter Participant 3>"},null,null,null,null,null,null,null,null,null,null,null,null,null,null,null,null,null,"pts",0,1,"","",0,null,"","","","","","","","","","","","","","","",""]
[{"$f":"'Week 1'!A14","v":"<Enter Participant 4>"},null,null,null,null,null,null,null,null,null,null,null,null,null,null,null,null,null,"pts",0,1,"","",0,null,"","","","","","","","","","","","","","","",""]
[{"$f":"'Week 1'!A15","v":"<Enter Participant 5>"},null,null,null,null,null,null,null,null,null,null,null,null,null,null,null,null,null,"pts",0,1,"","",0,null,"","","","","","","","","","","","","","","",""]
[{"$f":"'Week 1'!A16","v":"<Enter Participant 6>"},null,null,null,null,null,null,null,null,null,null,null,null,null,null,null,null,null,"pts",0,1,"","",0,null,"","","","","","","","","","","","","","","",""]
[{"$f":"'Week 1'!A17","v":"<Enter Participant 7>"},null,null,null,null,null,null,null,null,null,null,null,null,null,null,null,null,null,"pts",0,1,"","",0,null,"","","","","","","","","","","","","","","",""]
[{"$f":"'Week 1'!A18","v":"<Enter Participant 8>"},null,null,null,null,null,null,null,null,null,null,null,null,null,null,null,null,null,"pts",0,1,"","",0,null,"","","","","","","","","","","","","","","",""]
[{"$f":"'Week 1'!A19","v":"<Enter Participant 9>"},null,null,null,null,null,null,null,null,null,null,null,null,null,null,null,null,null,"pts",0,1,"","",0,null,"","","","","","","","","","","","","","","",""]
[{"$f":"'Week 1'!A20","v":"<Enter Participant 10>"},null,null,null,null,null,null,null,null,null,null,null,null,null,null,null,null,null,"pts",0,1,"","",0,null,"","","","","","","","","","","","","","","",""]
[{"$f":"'Week 1'!A21","v":"<Enter Participant 11>"},null,null,null,null,null,null,null,null,null,null,null,null,null,null,null,null,null,"pts",0,1,"","",0,null,"","","","","","","","","","","","","","","",""]
[{"$f":"'Week 1'!A22","v":"<Enter Participant 12>"},null,null,null,null,null,null,null,null,null,null,null,null,null,null,null,null,null,"pts",0,1,"","",0,null,"","","","","","","","","","","","","","","",""]
[{"$f":"'Week 1'!A23","v":"<Enter Participant 13>"},null,null,null,null,null,null,null,null,null,null,null,null,null,null,null,null,null,"pts",0,1,"","",0,null,"","","","","","","","","","","","","","","",""]
[{"$f":"'Week 1'!A24","v":"<Enter Participant 14>"},null,null,null,null,null,null,null,null,null,null,null,null,null,null,null,null,null,"pts",0,1,"","",0,null,"","","","","","","","","","","","","","","",""]
[{"$f":"'Week 1'!A25","v":"<Enter Participant 15>"},null,null,null,null,null,null,null,null,null,null,null,null,null,null,null,null,null,"pts",0,1,"","",0,null,"","","","","","","","","","","","","","","",""]
[{"$f":"'Week 1'!A26","v":"<Enter Participant 16>"},null,null,null,null,null,null,null,null,null,null,null,null,null,null,null,null,null,"pts",0,1,"","",0,null,"","","","","","","","","","","","","","","",{"$f":"IF(ISBLANK(Q$6),\"\",IF(Q26=Q$6,1,0))","v":""}]
[{"$f":"'Week 1'!A27","v":"<Enter Participant 17>"},null,null,null,null,null,null,null,null,null,null,null,null,null,null,null,null,null,"pts",0,1,"","",0,null,{"$f":"IF(ISBLANK(B$6),\"\",IF(B27=B$6,1,0))","v":""},"","","","","","","","","","","","","","",""]
[{"$f":"'Week 1'!A28","v":"<Enter Participant 18>"},null,null,null,null,null,null,null,null,null,null,null,null,null,null,null,null,null,"pts",0,1,"","",0,null,"","","","","","","","","","","","","","","",""]
[{"$f":"'Week 1'!A29","v":"<Enter Participant 19>"},null,null,null,null,null,null,null,null,null,null,null,null,null,null,null,null,null,"pts",0,1,"","",0,null,"","","","","","","","","","","","","","","",""]
[{"$f":"'Week 1'!A30","v":"<Enter Participant 20>"},null,null,null,null,null,null,null,null,null,null,null,null,null,null,null,null,null,"pts",0,1,"","",0,null,"","","","","","","","","","","","","","","",""]
[{"$f":"'Week 1'!A31","v":"<Enter Participant 21>"},null,null,null,null,null,null,null,null,null,null,null,null,null,null,null,null,null,"pts",0,1,"","",0,null,"","","","","","","","","","","","","","","",""]
[{"$f":"'Week 1'!A32","v":"<Enter Participant 22>"},null,null,null,null,null,null,null,null,null,null,null,null,null,null,null,null,null,"pts",0,1,"","",0,null,"","","","","","","","","","","","","","","",""]
[{"$f":"'Week 1'!A33","v":"<Enter Participant 23>"},null,null,null,null,null,null,null,null,null,null,null,null,null,null,null,null,null,"pts",0,1,"","",0,null,"","","","","","","","","","","","","","","",""]
[{"$f":"'Week 1'!A34","v":"<Enter Participant 24>"},null,null,null,null,null,null,null,null,null,null,null,null,null,null,null,null,null,"pts",0,1,"","",0,null,"","","","","","","","","","","","","","","",""]
[{"$f":"'Week 1'!A35","v":"<Enter Participant 25>"},null,null,null,null,null,null,null,null,null,null,null,null,null,null,null,null,null,"pts",0,1,"","",0,null,"","","","","","","","","","","","","","","",""]
[{"$f":"'Week 1'!A36","v":"<Enter Participant 26>"},null,null,null,null,null,null,null,null,null,null,null,null,null,null,null,null,null,"pts",0,1,"","",0,null,"","","","","","","","","","","","","","","",""]
[{"$f":"'Week 1'!A37","v":"<Enter Participant 27>"},null,null,null,null,null,null,null,null,null,null,null,null,null,null,null,null,null,"pts",0,1,"","",0,null,"","","","","","","","","","","","","","","",""]
[{"$f":"'Week 1'!A38","v":"<Enter Participant 28>"},null,null,null,null,null,null,null,null,null,null,null,null,null,null,null,null,null,"pts",0,1,"","",0,null,"","","","","","","","","","","","","","","",""]
[{"$f":"'Week 1'!A39","v":"<Enter Participant 29>"},null,null,null,null,null,null,null,null,null,null,null,null,null,null,null,null,null,"pts",0,1,"","",0,null,"","","","","","","","","","","","","","","",""]
[{"$f":"'Week 1'!A40","v":"<Enter Participant 30>"},null,null,null,null,null,null,null,null,null,null,null,null,null,null,null,null,null,"pts",0,1,"","",0,null,"","","","","","","","","","","","","","","",""]
[{"$f":"'Week 1'!A41","v":"<Enter Participant 31>"},null,null,null,null,null,null,null,null,null,null,null,null,null,null,null,null,null,"pts",0,1,"","",0,null,"","","","","","","","","","","","","","","",""]
[{"$f":"'Week 1'!A42","v":"<Enter Participant 32>"},null,null,null,null,null,null,null,null,null,null,null,null,null,null,null,null,null,"pts",0,1,"","",0,null,"","","","","","","","","","","","","","","",""]
[{"$f":"'Week 1'!A43","v":"<Enter Participant 33>"},null,null,null,null,null,null,null,null,null,null,null,null,null,null,null,null,null,"pts",{"$f":"IF(SUM(Z43:AO43)=0,0,SUM(Z43:AO43))","v":0},1,"","",{"$f":"VLOOKUP(A43,CUMULATIVE_TABLE,X$1,FALSE)","v":0},null,"","","","","","","","","","","","","","","",""]
[{"$f":"'Week 1'!A44","v":"<Enter Participant 34>"},null,null,null,null,null,null,null,null,null,null,null,null,null,null,null,null,null,"pts",0,1,"","",0,null,{"$f":"IF(ISBLANK(B$6),\"\",IF(B44=B$6,1,0))","v":""},"","","","","","","","","","","","","","",""]
[{"$f":"'Week 1'!A45","v":"<Enter Participant 35>"},null,null,null,null,null,null,null,null,null,null,null,null,null,null,null,null,null,"pts",0,1,"","",0,null,"","","","","","","","","","","","","","","",""]
[{"$f":"'Week 1'!A46","v":"<Enter Participant 36>"},null,null,null,null,null,null,null,null,null,null,null,null,null,null,null,null,null,"pts",0,1,"","",0,null,"","","","","","","","","","","","","","","",""]
[{"$f":"'Week 1'!A47","v":"<Enter Participant 37>"},null,null,null,null,null,null,null,null,null,null,null,null,null,null,null,null,null,"pts",0,1,"","",0,null,"","","","","","","","","","","","","","","",""]
[{"$f":"'Week 1'!A48","v":"<Enter Participant 38>"},null,null,null,null,null,null,null,null,null,null,null,null,null,null,null,null,null,"pts",0,1,"","",0,null,"","","","","","","","","","","","","","","",""]
[{"$f":"'Week 1'!A49","v":"<Enter Participant 39>"},null,null,null,null,null,null,null,null,null,null,null,null,null,null,null,null,null,"pts",0,1,"","",0,null,"","","","","","","","","","","","","","","",""]
[{"$f":"'Week 1'!A50","v":"<Enter Participant 40>"},null,null,null,null,null,null,null,null,null,null,null,null,null,null,null,null,null,"pts",0,1,"","",0,null,"","","","","","","","","","","","","","","",""]
[{"$f":"'Week 1'!A51","v":"<Enter Participant 41>"},null,null,null,null,null,null,null,null,null,null,null,null,null,null,null,null,null,"pts",0,1,"","",0,null,"","","","","","","","","","","","","","","",""]
[{"$f":"'Week 1'!A52","v":"<Enter Participant 42>"},null,null,null,null,null,null,null,null,null,null,null,null,null,null,null,null,null,"pts",0,1,"","",0,null,"","","","","","","","","","","","","","","",""]
[{"$f":"'Week 1'!A53","v":"<Enter Participant 43>"},null,null,null,null,null,null,null,null,null,null,null,null,null,null,null,null,null,"pts",0,1,"","",0,null,"","","","","","","","","","","","","","","",""]
[{"$f":"'Week 1'!A54","v":"<Enter Participant 44>"},null,null,null,null,null,null,null,null,null,null,null,null,null,null,null,null,null,"pts",0,1,"","",0,null,"","","","","","","","","","","","","","","",""]
[{"$f":"'Week 1'!A55","v":"<Enter Participant 45>"},null,null,null,null,null,null,null,null,null,null,null,null,null,null,null,null,null,"pts",0,1,"","",0,null,"","","","","","","","","","","","","","","",""]
[{"$f":"'Week 1'!A56","v":"<Enter Participant 46>"},null,null,null,null,null,null,null,null,null,null,null,null,null,null,null,null,null,"pts",0,1,"","",0,null,"","","","","","","","","","","","","","","",""]
[{"$f":"'Week 1'!A57","v":"<Enter Participant 47>"},null,null,null,null,null,null,null,null,null,null,null,null,null,null,null,null,null,"pts",0,1,"","",0,null,"","","","","","","","","","","","","","","",""]
[{"$f":"'Week 1'!A58","v":"<Enter Participant 48>"},null,null,null,null,null,null,null,null,null,null,null,null,null,null,null,null,null,"pts",0,1,"","",0,null,"","","","","","","","","","","","","","","",""]
[{"$f":"'Week 1'!A59","v":"<Enter Participant 49>"},null,null,null,null,null,null,null,null,null,null,null,null,null,null,null,null,null,"pts",0,1,"","",0,null,"","","","","","","","","","","","","","","",""]
[{"$f":"'Week 1'!A60","v":"<Enter Participant 50>"},null,null,null,null,null,null,null,null,null,null,null,null,null,null,null,null,null,"pts",0,1,"","",0,null,"","","","","","","","","","","","","","","",""]
[{"$f":"'Week 1'!A61","v":"<Enter Participant 51>"},null,null,null,null,null,null,null,null,null,null,null,null,null,null,null,null,null,"pts",0,1,"","",0,null,{"$f":"IF(ISBLANK(B$6),\"\",IF(B61=B$6,1,0))","v":""},"","","","","","","","","","","","","","",""]
[{"$f":"'Week 1'!A62","v":"<Enter Participant 52>"},null,null,null,null,null,null,null,null,null,null,null,null,null,null,null,null,null,"pts",0,1,"","",0,null,"","","","","","","","","","","","","","","",""]
[{"$f":"'Week 1'!A63","v":"<Enter Participant 53>"},null,null,null,null,null,null,null,null,null,null,null,null,null,null,null,null,null,"pts",0,1,"","",0,null,"","","","","","","","","","","","","","","",""]
[{"$f":"'Week 1'!A64","v":"<Enter Participant 54>"},null,null,null,null,null,null,null,null,null,null,null,null,null,null,null,null,null,"pts",0,1,"","",0,null,"","","","","","","","","","","","","","","",""]
[{"$f":"'Week 1'!A65","v":"<Enter Participant 55>"},null,null,null,null,null,null,null,null,null,null,null,null,null,null,null,null,null,"pts",0,1,"","",0,null,"","","","","","","","","","","","","","","",""]
[{"$f":"'Week 1'!A66","v":"<Enter Participant 56>"},null,null,null,null,null,null,null,null,null,null,null,null,null,null,null,null,null,"pts",0,1,"","",0,null,"","","","","","","","","","","","","","","",""]
[{"$f":"'Week 1'!A67","v":"<Enter Participant 57>"},null,null,null,null,null,null,null,null,null,null,null,null,null,null,null,null,null,"pts",0,1,"","",0,null,"","","","","","","","","","","","","","","",""]
[{"$f":"'Week 1'!A68","v":"<Enter Participant 58>"},null,null,null,null,null,null,null,null,null,null,null,null,null,null,null,null,null,"pts",0,1,"","",0,null,"","","","","","","","","","","","","","","",""]
[{"$f":"'Week 1'!A69","v":"<Enter Participant 59>"},null,null,null,null,null,null,null,null,null,null,null,null,null,null,null,null,null,"pts",0,1,"","",0,null,"","","","","","","","","","","","","","","",""]
[{"$f":"'Week 1'!A70","v":"<Enter Participant 60>"},null,null,null,null,null,null,null,null,null,null,null,null,null,null,null,null,null,"pts",0,1,"","",0,null,"","","","","","","","","","","","","","","",""]
[{"$f":"'Week 1'!A71","v":"<Enter Participant 61>"},null,null,null,null,null,null,null,null,null,null,null,null,null,null,null,null,null,"pts",0,1,"","",0,null,"","","","","","","","","","","","","","","",""]
[{"$f":"'Week 1'!A72","v":"<Enter Participant 62>"},null,null,null,null,null,null,null,null,null,null,null,null,null,null,null,null,null,"pts",0,1,"","",0,null,"","","","","","","","","","","","","","","",""]
[{"$f":"'Week 1'!A73","v":"<Enter Participant 63>"},null,null,null,null,null,null,null,null,null,null,null,null,null,null,null,null,null,"pts",0,1,"","",0,null,"","","","","","","","","","","","","","","",""]
[{"$f":"'Week 1'!A74","v":"<Enter Participant 64>"},null,null,null,null,null,null,null,null,null,null,null,null,null,null,null,null,null,"pts",0,1,"","",0,null,"","","","","","","","","","","","","","","",""]
[{"$f":"'Week 1'!A75","v":"<Enter Participant 65>"},null,null,null,null,null,null,null,null,null,null,null,null,null,null,null,null,null,"pts",0,{"$f":"IF(ISERROR(RANK(T75,$T$11:$T$85)),\"\",RANK(T75,$T$11:$T$85))","v":1},{"$f":"IF(ISBLANK(R75),\"\",IF(U75=1,ABS(R75-R$6),\"\"))","v":""},{"$f":"IF(ISERROR(RANK(V75,$V$11:$V$85,1)),\"\",RANK(V75,$V$11:$V$85,1))","v":""},{"$f":"VLOOKUP(A75,CUMULATIVE_TABLE,X$1,FALSE)","v":0},null,"","","","","","","","","","","","","","","",""]
[{"$f":"'Week 1'!A76","v":"<Enter Participant 66>"},null,null,null,null,null,null,null,null,null,null,null,null,null,null,null,null,null,"pts",0,1,"","",0,null,"","","","","","","","","","","","","","","",""]
[{"$f":"'Week 1'!A77","v":"<Enter Participant 67>"},null,null,null,null,null,null,null,null,null,null,null,null,null,null,null,null,null,"pts",0,1,"","",0,null,"","","","","","","","","","","","","","","",""]
[{"$f":"'Week 1'!A78","v":"<Enter Participant 68>"},null,null,null,null,null,null,null,null,null,null,null,null,null,null,null,null,null,"pts",0,1,"","",0,null,{"$f":"IF(ISBLANK(B$6),\"\",IF(B78=B$6,1,0))","v":""},"","","","","","","","","","","","","","",""]
[{"$f":"'Week 1'!A79","v":"<Enter Participant 69>"},null,null,null,null,null,null,null,null,null,null,null,null,null,null,null,null,null,"pts",0,1,"","",0,null,"","","","","","","","","","","","","","","",""]
[{"$f":"'Week 1'!A80","v":"<Enter Participant 70>"},null,null,null,null,null,null,null,null,null,null,null,null,null,null,null,null,null,"pts",0,1,"","",0,null,"","","","","","","","","","","","","","","",""]
[{"$f":"'Week 1'!A81","v":"<Enter Participant 71>"},null,null,null,null,null,null,null,null,null,null,null,null,null,null,null,null,null,"pts",0,1,"","",0,null,"","","","","","","","","","","","","","","",""]
[{"$f":"'Week 1'!A82","v":"<Enter Participant 72>"},null,null,null,null,null,null,null,null,null,null,null,null,null,null,null,null,null,"pts",0,1,"","",0,null,"","","","","","","","","","","","","","","",""]
[{"$f":"'Week 1'!A83","v":"<Enter Participant 73>"},null,null,null,null,null,null,null,null,null,null,null,null,null,null,null,null,null,"pts",0,1,"","",0,null,"","","","","","","","","","","","","","","",""]
[{"$f":"'Week 1'!A84","v":"<Enter Participant 74>"},null,null,null,null,null,null,null,null,null,null,null,null,null,null,null,null,null,"pts",0,1,"","",0,null,"","","","","","","","","","","","","","","",""]
[{"$f":"'Week 1'!A85","v":"<Enter Participant 75>"},null,null,null,null,null,null,null,null,null,null,null,null,null,null,null,null,null,"pts",0,1,"","",0,null,"","","","","","","","","","","","","","","",""]
[{"$f":"'Week 1'!A86","v":"<Enter Participant 76>"},null,null,null,null,null,null,null,null,null,null,null,null,null,null,null,null,null,"pts",0,1,"","",0,null,"","","","","","","","","","","","","","","",""]
[{"$f":"'Week 1'!A87","v":"<Enter Participant 77>"},null,null,null,null,null,null,null,null,null,null,null,null,null,null,null,null,null,"pts",0,1,"","",0,null,"","","","","","","","","","","","","","","",""]
[{"$f":"'Week 1'!A88","v":"<Enter Participant 78>"},null,null,null,null,null,null,null,null,null,null,null,null,null,null,null,null,null,"pts",0,1,"","",0,null,"","","","","","","","","","","","","","","",""]
[{"$f":"'Week 1'!A89","v":"<Enter Participant 79>"},null,null,null,null,null,null,null,null,null,null,null,null,null,null,null,null,null,"pts",0,1,"","",0,null,"","","","","","","","","","","","","","","",""]
[{"$f":"'Week 1'!A90","v":"<Enter Participant 80>"},null,null,null,null,null,null,null,null,null,null,null,null,null,null,null,null,null,"pts",0,1,"","",0,null,"","","","","","","","","","","","","","","",""]
[{"$f":"'Week 1'!A91","v":"<Enter Participant 81>"},null,null,null,null,null,null,null,null,null,null,null,null,null,null,null,null,null,"pts",0,1,"","",0,null,"","","","","","","","","","","","","","","",""]
[{"$f":"'Week 1'!A92","v":"<Enter Participant 82>"},null,null,null,null,null,null,null,null,null,null,null,null,null,null,null,null,null,"pts",0,1,"","",0,null,"","","","","","","","","","","","","","","",""]
[{"$f":"'Week 1'!A93","v":"<Enter Participant 83>"},null,null,null,null,null,null,null,null,null,null,null,null,null,null,null,null,null,"pts",0,1,"","",0,null,"","","","","","","","","","","","","","","",""]
[{"$f":"'Week 1'!A94","v":"<Enter Participant 84>"},null,null,null,null,null,null,null,null,null,null,null,null,null,null,null,null,null,"pts",0,1,"","",0,null,{"$f":"IF(ISBLANK(B$6),\"\",IF(B94=B$6,1,0))","v":""},"","","","","","","","","","","","","","",""]
[{"$f":"'Week 1'!A95","v":"<Enter Participant 85>"},null,null,null,null,null,null,null,null,null,null,null,null,null,null,null,null,null,"pts",0,1,"","",0,null,"","","","","","","","","","","","","","","",""]
[{"$f":"'Week 1'!A96","v":"<Enter Participant 86>"},null,null,null,null,null,null,null,null,null,null,null,null,null,null,null,null,null,"pts",0,1,"","",0,null,"","","","","","","","","","","","","","","",""]
[{"$f":"'Week 1'!A97","v":"<Enter Participant 87>"},null,null,null,null,null,null,null,null,null,null,null,null,null,null,null,null,null,"pts",0,1,"","",0,null,"","","","","","","","","","","","","","","",""]
[{"$f":"'Week 1'!A98","v":"<Enter Participant 88>"},null,null,null,null,null,null,null,null,null,null,null,null,null,null,null,null,null,"pts",0,1,"","",0,null,"","","","","","","","","","","","","","","",""]
[{"$f":"'Week 1'!A99","v":"<Enter Participant 89>"},null,null,null,null,null,null,null,null,null,null,null,null,null,null,null,null,null,"pts",0,1,"","",0,null,"","","","","","","","","","","","","","","",""]
[{"$f":"'Week 1'!A100","v":"<Enter Participant 90>"},null,null,null,null,null,null,null,null,null,null,null,null,null,null,null,null,null,"pts",0,1,"","",0,null,"","","","","","","","","","","","","","","",""]
[{"$f":"'Week 1'!A101","v":"<Enter Participant 91>"},null,null,null,null,null,null,null,null,null,null,null,null,null,null,null,null,null,"pts",0,1,"","",0,null,"","","","","","","","","","","","","","","",""]
[{"$f":"'Week 1'!A102","v":"<Enter Participant 92>"},null,null,null,null,null,null,null,null,null,null,null,null,null,null,null,null,null,"pts",0,1,"","",0,null,"","","","","","","","","","","","","","","",""]
[{"$f":"'Week 1'!A103","v":"<Enter Participant 93>"},null,null,null,null,null,null,null,null,null,null,null,null,null,null,null,null,null,"pts",0,1,"","",0,null,"","","","","","","","","","","","","","","",""]
[{"$f":"'Week 1'!A104","v":"<Enter Participant 94>"},null,null,null,null,null,null,null,null,null,null,null,null,null,null,null,null,null,"pts",0,1,"","",0,null,"","","","","","","","","","","","","","","",""]
[{"$f":"'Week 1'!A105","v":"<Enter Participant 95>"},null,null,null,null,null,null,null,null,null,null,null,null,null,null,null,null,null,"pts",0,1,"","",0,null,"","","","","","","","","","","","","","","",""]
[{"$f":"'Week 1'!A106","v":"<Enter Participant 96>"},null,null,null,null,null,null,null,null,null,null,null,null,null,null,null,null,null,"pts",0,1,"","",0,null,"","","","","","","","","","","","","","","",""]
[{"$f":"'Week 1'!A107","v":"<Enter Participant 97>"},null,null,null,null,null,null,null,null,null,null,null,null,null,null,null,null,null,"pts",{"$f":"IF(SUM(Z107:AO107)=0,0,SUM(Z107:AO107))","v":0},1,"","",0,null,"","","","","","","","","","","","","","","",""]
[{"$f":"'Week 1'!A108","v":"<Enter Participant 98>"},null,null,null,null,null,null,null,null,null,null,null,null,null,null,null,null,null,"pts",0,1,"","",0,null,"","","","","","","","","","","","","","","",""]
[{"$f":"'Week 1'!A109","v":"<Enter Participant 99>"},null,null,null,null,null,null,null,null,null,null,null,null,null,null,null,null,null,"pts",0,1,"","",0,null,"","","","","","","","","","","","","","","",{"$f":"IF(ISBLANK(Q$6),\"\",IF(Q109=Q$6,1,0))","v":""}]
[{"$f":"'Week 1'!A110","v":"<Enter Participant 100>"},null,null,null,null,null,null,null,null,null,null,null,null,null,null,null,null,null,"pts",0,1,"","",0,null,{"$f":"IF(ISBLANK(B$6),\"\",IF(B110=B$6,1,0))","v":""},"","","","","","","","","","","","","","",""]

{"sheet":"Week 14","index":13,"n_rows":110,"n_cols":41,"rows_kept":110,"cut":false,"hidden":false,"merged":[[1,17,1,18],[1,19,3,23],[4,23,9,23],[9,17,9,18]]}
["Week Lookup Column Offset",2,3,4,5,6,7,8,9,10,11,12,13,14,15,16,17,null,null,null,null,null,null,{"$f":"MID(T2,FIND(\" \",T2)+1,2)*1+18","v":32}]
[null,"GAME 1","GAME 2","GAME 3","GAME 4","GAME 5","GAME 6","GAME 7","GAME 8","GAME 9","GAME 10","GAME 11","GAME 12","GAME 13","GAME 14","GAME 15","GAME 16","SCORE",null,"Week 14"]
["VISITOR",{"$f":"IF(VLOOKUP($T$2&\" Visitors\",SCHEDULE_TABLE,B$1,FALSE)=0,\"\",VLOOKUP($T$2&\" Visitors\",SCHEDULE_TABLE,B$1,FALSE))","v":"DAL"},"PIT","IND","TB","HOU","BAL","NYJ","CAR","NYG","STL","KC","BUF","SF","SEA","NE","ATL",null,"pts"]
[null,"at","at","at","at","at","at","at","at","at","at","at","at","at","at","at","at"]
["HOME",{"$f":"IF(VLOOKUP($T$2&\" Homes\",SCHEDULE_TABLE,B$1,FALSE)=0,\"\",VLOOKUP($T$2&\" Homes\",SCHEDULE_TABLE,B$1,FALSE))","v":"CHI"},"CIN","CLE","DET","JAX","MIA","MIN","NO","TEN","WAS","ARI","DEN","OAK","PHI","SD","GB",null,"pts",null,null,null,null,"TOTAL POINTS FOR YEAR"]
["WINNER",null,null,null,null,null,null,null,null,null,null,null,null,null,null,null,null,{"$f":"IF(R3+R5=0,\"\",R3+R5)","v":""},"pts"]
[null,{"$f":"B3","v":"DAL"},"PIT","IND","TB","HOU","BAL","NYJ","CAR","NYG","STL","KC","BUF","SF","SEA","NE","ATL"]
[null,{"$f":"B5","v":"CHI"},"CIN","CLE","DET","JAX","MIA","MIN","NO","TEN","WAS","ARI","DEN","OAK","PHI","SD","GB"]
[]
["NAME","PICKS","PICKS","PICKS","PICKS","PICKS","PICKS","PICKS","PICKS","PICKS","PICKS","PICKS","PICKS","PICKS","PICKS","PICKS","PICKS","TIE-BREAK",null,"PICK PTS","PTS RANK","ABS DIFF","TIE-BREAK"]
[{"$f":"'Week 1'!A11","v":"<Enter Participant 1>"},null,null,null,null,null,null,null,null,null,null,null,null,null,null,null,null,null,"pts",{"$f":"IF(SUM(Z11:AO11)=0,0,SUM(Z11:AO11))","v":0},{"$f":"IF(ISERROR(RANK(T11,$T$11:$T$85)),\"\",RANK(T11,$T$11:$T$85))","v":1},{"$f":"IF(ISBLANK(R11),\"\",IF(U11=1,ABS(R11-R$6),\"\"))","v":""},{"$f":"IF(ISERROR(RANK(V11,$V$11:$V$85,1)),\"\",RANK(V11,$V$11:$V$85,1))","v":""},{"$f":"VLOOKUP(A11,CUMULATIVE_TABLE,X$1,FALSE)","v":0},null,{"$f":"IF(ISBLANK(B$6),\"\",IF(B11=B$6,1,0))","v":""},"","","","","","","","","","","","","","",""]
[{"$f":"'Week 1'!A12","v":"<Enter Participant 2>"},null,null,null,null,null,null,null,null,null,null,null,null,null,null,null,null,null,"pts",0,1,"","",0,null,"","","","","","","","","","","","","","","",""]
[{"$f":"'Week 1'!A13","v":"<Enter Participant 3>"},null,null,null,null,null,null,null,null,null,null,null,null,null,null,null,null,null,"pts",0,1,"","",0,null,"","","","","","","","","","","","","","","",""]
[{"$f":"'Week 1'!A14","v":"<Enter Participant 4>"},null,null,null,null,null,null,null,null,null,null,null,null,null,null,null,null,null,"pts",0,1,"","",0,null,"","","","","","","","","","","","","","","",""]
[{"$f":"'Week 1'!A15","v":"<Enter Participant 5>"},null,null,null,null,null,null,null,null,null,null,null,null,null,null,null,null,null,"pts",0,1,"","",0,null,"","","","","","","","","","","","","","","",""]
[{"$f":"'Week 1'!A16","v":"<Enter Participant 6>"},null,null,null,null,null,null,null,null,null,null,null,null,null,null,null,null,null,"pts",0,1,"","",0,null,"","","","","","","","","","","","","","","",""]
[{"$f":"'Week 1'!A17","v":"<Enter Participant 7>"},null,null,null,null,null,null,null,null,null,null,null,null,null,null,null,null,null,"pts",0,1,"","",0,null,"","","","","","","","","","","","","","","",""]
[{"$f":"'Week 1'!A18","v":"<Enter Participant 8>"},null,null,null,null,null,null,null,null,null,null,null,null,null,null,null,null,null,"pts",0,1,"","",0,null,"","","","","","","","","","","","","","","",""]
[{"$f":"'Week 1'!A19","v":"<Enter Participant 9>"},null,null,null,null,null,null,null,null,null,null,null,null,null,null,null,null,null,"pts",0,1,"","",0,null,"","","","","","","","","","","","","","","",""]
[{"$f":"'Week 1'!A20","v":"<Enter Participant 10>"},null,null,null,null,null,null,null,null,null,null,null,null,null,null,null,null,null,"pts",0,1,"","",0,null,"","","","","","","","","","","","","","","",""]
[{"$f":"'Week 1'!A21","v":"<Enter Participant 11>"},null,null,null,null,null,null,null,null,null,null,null,null,null,null,null,null,null,"pts",0,1,"","",0,null,"","","","","","","","","","","","","","","",""]
[{"$f":"'Week 1'!A22","v":"<Enter Participant 12>"},null,null,null,null,null,null,null,null,null,null,null,null,null,null,null,null,null,"pts",0,1,"","",0,null,"","","","","","","","","","","","","","","",""]
[{"$f":"'Week 1'!A23","v":"<Enter Participant 13>"},null,null,null,null,null,null,null,null,null,null,null,null,null,null,null,null,null,"pts",0,1,"","",0,null,"","","","","","","","","","","","","","","",""]
[{"$f":"'Week 1'!A24","v":"<Enter Participant 14>"},null,null,null,null,null,null,null,null,null,null,null,null,null,null,null,null,null,"pts",0,1,"","",0,null,"","","","","","","","","","","","","","","",""]
[{"$f":"'Week 1'!A25","v":"<Enter Participant 15>"},null,null,null,null,null,null,null,null,null,null,null,null,null,null,null,null,null,"pts",0,1,"","",0,null,"","","","","","","","","","","","","","","",""]
[{"$f":"'Week 1'!A26","v":"<Enter Participant 16>"},null,null,null,null,null,null,null,null,null,null,null,null,null,null,null,null,null,"pts",0,1,"","",0,null,"","","","","","","","","","","","","","","",{"$f":"IF(ISBLANK(Q$6),\"\",IF(Q26=Q$6,1,0))","v":""}]
[{"$f":"'Week 1'!A27","v":"<Enter Participant 17>"},null,null,null,null,null,null,null,null,null,null,null,null,null,null,null,null,null,"pts",0,1,"","",0,null,{"$f":"IF(ISBLANK(B$6),\"\",IF(B27=B$6,1,0))","v":""},"","","","","","","","","","","","","","",""]
[{"$f":"'Week 1'!A28","v":"<Enter Participant 18>"},null,null,null,null,null,null,null,null,null,null,null,null,null,null,null,null,null,"pts",0,1,"","",0,null,"","","","","","","","","","","","","","","",""]
[{"$f":"'Week 1'!A29","v":"<Enter Participant 19>"},null,null,null,null,null,null,null,null,null,null,null,null,null,null,null,null,null,"pts",0,1,"","",0,null,"","","","","","","","","","","","","","","",""]
[{"$f":"'Week 1'!A30","v":"<Enter Participant 20>"},null,null,null,null,null,null,null,null,null,null,null,null,null,null,null,null,null,"pts",0,1,"","",0,null,"","","","","","","","","","","","","","","",""]
[{"$f":"'Week 1'!A31","v":"<Enter Participant 21>"},null,null,null,null,null,null,null,null,null,null,null,null,null,null,null,null,null,"pts",0,1,"","",0,null,"","","","","","","","","","","","","","","",""]
[{"$f":"'Week 1'!A32","v":"<Enter Participant 22>"},null,null,null,null,null,null,null,null,null,null,null,null,null,null,null,null,null,"pts",0,1,"","",0,null,"","","","","","","","","","","","","","","",""]
[{"$f":"'Week 1'!A33","v":"<Enter Participant 23>"},null,null,null,null,null,null,null,null,null,null,null,null,null,null,null,null,null,"pts",0,1,"","",0,null,"","","","","","","","","","","","","","","",""]
[{"$f":"'Week 1'!A34","v":"<Enter Participant 24>"},null,null,null,null,null,null,null,null,null,null,null,null,null,null,null,null,null,"pts",0,1,"","",0,null,"","","","","","","","","","","","","","","",""]
[{"$f":"'Week 1'!A35","v":"<Enter Participant 25>"},null,null,null,null,null,null,null,null,null,null,null,null,null,null,null,null,null,"pts",0,1,"","",0,null,"","","","","","","","","","","","","","","",""]
[{"$f":"'Week 1'!A36","v":"<Enter Participant 26>"},null,null,null,null,null,null,null,null,null,null,null,null,null,null,null,null,null,"pts",0,1,"","",0,null,"","","","","","","","","","","","","","","",""]
[{"$f":"'Week 1'!A37","v":"<Enter Participant 27>"},null,null,null,null,null,null,null,null,null,null,null,null,null,null,null,null,null,"pts",0,1,"","",0,null,"","","","","","","","","","","","","","","",""]
[{"$f":"'Week 1'!A38","v":"<Enter Participant 28>"},null,null,null,null,null,null,null,null,null,null,null,null,null,null,null,null,null,"pts",0,1,"","",0,null,"","","","","","","","","","","","","","","",""]
[{"$f":"'Week 1'!A39","v":"<Enter Participant 29>"},null,null,null,null,null,null,null,null,null,null,null,null,null,null,null,null,null,"pts",0,1,"","",0,null,"","","","","","","","","","","","","","","",""]
[{"$f":"'Week 1'!A40","v":"<Enter Participant 30>"},null,null,null,null,null,null,null,null,null,null,null,null,null,null,null,null,null,"pts",0,1,"","",0,null,"","","","","","","","","","","","","","","",""]
[{"$f":"'Week 1'!A41","v":"<Enter Participant 31>"},null,null,null,null,null,null,null,null,null,null,null,null,null,null,null,null,null,"pts",0,1,"","",0,null,"","","","","","","","","","","","","","","",""]
[{"$f":"'Week 1'!A42","v":"<Enter Participant 32>"},null,null,null,null,null,null,null,null,null,null,null,null,null,null,null,null,null,"pts",0,1,"","",0,null,"","","","","","","","","","","","","","","",""]
[{"$f":"'Week 1'!A43","v":"<Enter Participant 33>"},null,null,null,null,null,null,null,null,null,null,null,null,null,null,null,null,null,"pts",{"$f":"IF(SUM(Z43:AO43)=0,0,SUM(Z43:AO43))","v":0},1,"","",{"$f":"VLOOKUP(A43,CUMULATIVE_TABLE,X$1,FALSE)","v":0},null,"","","","","","","","","","","","","","","",""]
[{"$f":"'Week 1'!A44","v":"<Enter Participant 34>"},null,null,null,null,null,null,null,null,null,null,null,null,null,null,null,null,null,"pts",0,1,"","",0,null,{"$f":"IF(ISBLANK(B$6),\"\",IF(B44=B$6,1,0))","v":""},"","","","","","","","","","","","","","",""]
[{"$f":"'Week 1'!A45","v":"<Enter Participant 35>"},null,null,null,null,null,null,null,null,null,null,null,null,null,null,null,null,null,"pts",0,1,"","",0,null,"","","","","","","","","","","","","","","",""]
[{"$f":"'Week 1'!A46","v":"<Enter Participant 36>"},null,null,null,null,null,null,null,null,null,null,null,null,null,null,null,null,null,"pts",0,1,"","",0,null,"","","","","","","","","","","","","","","",""]
[{"$f":"'Week 1'!A47","v":"<Enter Participant 37>"},null,null,null,null,null,null,null,null,null,null,null,null,null,null,null,null,null,"pts",0,1,"","",0,null,"","","","","","","","","","","","","","","",""]
[{"$f":"'Week 1'!A48","v":"<Enter Participant 38>"},null,null,null,null,null,null,null,null,null,null,null,null,null,null,null,null,null,"pts",0,1,"","",0,null,"","","","","","","","","","","","","","","",""]
[{"$f":"'Week 1'!A49","v":"<Enter Participant 39>"},null,null,null,null,null,null,null,null,null,null,null,null,null,null,null,null,null,"pts",0,1,"","",0,null,"","","","","","","","","","","","","","","",""]
[{"$f":"'Week 1'!A50","v":"<Enter Participant 40>"},null,null,null,null,null,null,null,null,null,null,null,null,null,null,null,null,null,"pts",0,1,"","",0,null,"","","","","","","","","","","","","","","",""]
[{"$f":"'Week 1'!A51","v":"<Enter Participant 41>"},null,null,null,null,null,null,null,null,null,null,null,null,null,null,null,null,null,"pts",0,1,"","",0,null,"","","","","","","","","","","","","","","",""]
[{"$f":"'Week 1'!A52","v":"<Enter Participant 42>"},null,null,null,null,null,null,null,null,null,null,null,null,null,null,null,null,null,"pts",0,1,"","",0,null,"","","","","","","","","","","","","","","",""]
[{"$f":"'Week 1'!A53","v":"<Enter Participant 43>"},null,null,null,null,null,null,null,null,null,null,null,null,null,null,null,null,null,"pts",0,1,"","",0,null,"","","","","","","","","","","","","","","",""]
[{"$f":"'Week 1'!A54","v":"<Enter Participant 44>"},null,null,null,null,null,null,null,null,null,null,null,null,null,null,null,null,null,"pts",0,1,"","",0,null,"","","","","","","","","","","","","","","",""]
[{"$f":"'Week 1'!A55","v":"<Enter Participant 45>"},null,null,null,null,null,null,null,null,null,null,null,null,null,null,null,null,null,"pts",0,1,"","",0,null,"","","","","","","","","","","","","","","",""]
[{"$f":"'Week 1'!A56","v":"<Enter Participant 46>"},null,null,null,null,null,null,null,null,null,null,null,null,null,null,null,null,null,"pts",0,1,"","",0,null,"","","","","","","","","","","","","","","",""]
[{"$f":"'Week 1'!A57","v":"<Enter Participant 47>"},null,null,null,null,null,null,null,null,null,null,null,null,null,null,null,null,null,"pts",0,1,"","",0,null,"","","","","","","","","","","","","","","",""]
[{"$f":"'Week 1'!A58","v":"<Enter Participant 48>"},null,null,null,null,null,null,null,null,null,null,null,null,null,null,null,null,null,"pts",0,1,"","",0,null,"","","","","","","","","","","","","","","",""]
[{"$f":"'Week 1'!A59","v":"<Enter Participant 49>"},null,null,null,null,null,null,null,null,null,null,null,null,null,null,null,null,null,"pts",0,1,"","",0,null,"","","","","","","","","","","","","","","",""]
[{"$f":"'Week 1'!A60","v":"<Enter Participant 50>"},null,null,null,null,null,null,null,null,null,null,null,null,null,null,null,null,null,"pts",0,1,"","",0,null,"","","","","","","","","","","","","","","",""]
[{"$f":"'Week 1'!A61","v":"<Enter Participant 51>"},null,null,null,null,null,null,null,null,null,null,null,null,null,null,null,null,null,"pts",0,1,"","",0,null,{"$f":"IF(ISBLANK(B$6),\"\",IF(B61=B$6,1,0))","v":""},"","","","","","","","","","","","","","",""]
[{"$f":"'Week 1'!A62","v":"<Enter Participant 52>"},null,null,null,null,null,null,null,null,null,null,null,null,null,null,null,null,null,"pts",0,1,"","",0,null,"","","","","","","","","","","","","","","",""]
[{"$f":"'Week 1'!A63","v":"<Enter Participant 53>"},null,null,null,null,null,null,null,null,null,null,null,null,null,null,null,null,null,"pts",0,1,"","",0,null,"","","","","","","","","","","","","","","",""]
[{"$f":"'Week 1'!A64","v":"<Enter Participant 54>"},null,null,null,null,null,null,null,null,null,null,null,null,null,null,null,null,null,"pts",0,1,"","",0,null,"","","","","","","","","","","","","","","",""]
[{"$f":"'Week 1'!A65","v":"<Enter Participant 55>"},null,null,null,null,null,null,null,null,null,null,null,null,null,null,null,null,null,"pts",0,1,"","",0,null,"","","","","","","","","","","","","","","",""]
[{"$f":"'Week 1'!A66","v":"<Enter Participant 56>"},null,null,null,null,null,null,null,null,null,null,null,null,null,null,null,null,null,"pts",0,1,"","",0,null,"","","","","","","","","","","","","","","",""]
[{"$f":"'Week 1'!A67","v":"<Enter Participant 57>"},null,null,null,null,null,null,null,null,null,null,null,null,null,null,null,null,null,"pts",0,1,"","",0,null,"","","","","","","","","","","","","","","",""]
[{"$f":"'Week 1'!A68","v":"<Enter Participant 58>"},null,null,null,null,null,null,null,null,null,null,null,null,null,null,null,null,null,"pts",0,1,"","",0,null,"","","","","","","","","","","","","","","",""]
[{"$f":"'Week 1'!A69","v":"<Enter Participant 59>"},null,null,null,null,null,null,null,null,null,null,null,null,null,null,null,null,null,"pts",0,1,"","",0,null,"","","","","","","","","","","","","","","",""]
[{"$f":"'Week 1'!A70","v":"<Enter Participant 60>"},null,null,null,null,null,null,null,null,null,null,null,null,null,null,null,null,null,"pts",0,1,"","",0,null,"","","","","","","","","","","","","","","",""]
[{"$f":"'Week 1'!A71","v":"<Enter Participant 61>"},null,null,null,null,null,null,null,null,null,null,null,null,null,null,null,null,null,"pts",0,1,"","",0,null,"","","","","","","","","","","","","","","",""]
[{"$f":"'Week 1'!A72","v":"<Enter Participant 62>"},null,null,null,null,null,null,null,null,null,null,null,null,null,null,null,null,null,"pts",0,1,"","",0,null,"","","","","","","","","","","","","","","",""]
[{"$f":"'Week 1'!A73","v":"<Enter Participant 63>"},null,null,null,null,null,null,null,null,null,null,null,null,null,null,null,null,null,"pts",0,1,"","",0,null,"","","","","","","","","","","","","","","",""]
[{"$f":"'Week 1'!A74","v":"<Enter Participant 64>"},null,null,null,null,null,null,null,null,null,null,null,null,null,null,null,null,null,"pts",0,1,"","",0,null,"","","","","","","","","","","","","","","",""]
[{"$f":"'Week 1'!A75","v":"<Enter Participant 65>"},null,null,null,null,null,null,null,null,null,null,null,null,null,null,null,null,null,"pts",0,{"$f":"IF(ISERROR(RANK(T75,$T$11:$T$85)),\"\",RANK(T75,$T$11:$T$85))","v":1},{"$f":"IF(ISBLANK(R75),\"\",IF(U75=1,ABS(R75-R$6),\"\"))","v":""},{"$f":"IF(ISERROR(RANK(V75,$V$11:$V$85,1)),\"\",RANK(V75,$V$11:$V$85,1))","v":""},{"$f":"VLOOKUP(A75,CUMULATIVE_TABLE,X$1,FALSE)","v":0},null,"","","","","","","","","","","","","","","",""]
[{"$f":"'Week 1'!A76","v":"<Enter Participant 66>"},null,null,null,null,null,null,null,null,null,null,null,null,null,null,null,null,null,"pts",0,1,"","",0,null,"","","","","","","","","","","","","","","",""]
[{"$f":"'Week 1'!A77","v":"<Enter Participant 67>"},null,null,null,null,null,null,null,null,null,null,null,null,null,null,null,null,null,"pts",0,1,"","",0,null,"","","","","","","","","","","","","","","",""]
[{"$f":"'Week 1'!A78","v":"<Enter Participant 68>"},null,null,null,null,null,null,null,null,null,null,null,null,null,null,null,null,null,"pts",0,1,"","",0,null,{"$f":"IF(ISBLANK(B$6),\"\",IF(B78=B$6,1,0))","v":""},"","","","","","","","","","","","","","",""]
[{"$f":"'Week 1'!A79","v":"<Enter Participant 69>"},null,null,null,null,null,null,null,null,null,null,null,null,null,null,null,null,null,"pts",0,1,"","",0,null,"","","","","","","","","","","","","","","",""]
[{"$f":"'Week 1'!A80","v":"<Enter Participant 70>"},null,null,null,null,null,null,null,null,null,null,null,null,null,null,null,null,null,"pts",0,1,"","",0,null,"","","","","","","","","","","","","","","",""]
[{"$f":"'Week 1'!A81","v":"<Enter Participant 71>"},null,null,null,null,null,null,null,null,null,null,null,null,null,null,null,null,null,"pts",0,1,"","",0,null,"","","","","","","","","","","","","","","",""]
[{"$f":"'Week 1'!A82","v":"<Enter Participant 72>"},null,null,null,null,null,null,null,null,null,null,null,null,null,null,null,null,null,"pts",0,1,"","",0,null,"","","","","","","","","","","","","","","",""]
[{"$f":"'Week 1'!A83","v":"<Enter Participant 73>"},null,null,null,null,null,null,null,null,null,null,null,null,null,null,null,null,null,"pts",0,1,"","",0,null,"","","","","","","","","","","","","","","",""]
[{"$f":"'Week 1'!A84","v":"<Enter Participant 74>"},null,null,null,null,null,null,null,null,null,null,null,null,null,null,null,null,null,"pts",0,1,"","",0,null,"","","","","","","","","","","","","","","",""]
[{"$f":"'Week 1'!A85","v":"<Enter Participant 75>"},null,null,null,null,null,null,null,null,null,null,null,null,null,null,null,null,null,"pts",0,1,"","",0,null,"","","","","","","","","","","","","","","",""]
[{"$f":"'Week 1'!A86","v":"<Enter Participant 76>"},null,null,null,null,null,null,null,null,null,null,null,null,null,null,null,null,null,"pts",0,1,"","",0,null,"","","","","","","","","","","","","","","",""]
[{"$f":"'Week 1'!A87","v":"<Enter Participant 77>"},null,null,null,null,null,null,null,null,null,null,null,null,null,null,null,null,null,"pts",0,1,"","",0,null,"","","","","","","","","","","","","","","",""]
[{"$f":"'Week 1'!A88","v":"<Enter Participant 78>"},null,null,null,null,null,null,null,null,null,null,null,null,null,null,null,null,null,"pts",0,1,"","",0,null,"","","","","","","","","","","","","","","",""]
[{"$f":"'Week 1'!A89","v":"<Enter Participant 79>"},null,null,null,null,null,null,null,null,null,null,null,null,null,null,null,null,null,"pts",0,1,"","",0,null,"","","","","","","","","","","","","","","",""]
[{"$f":"'Week 1'!A90","v":"<Enter Participant 80>"},null,null,null,null,null,null,null,null,null,null,null,null,null,null,null,null,null,"pts",0,1,"","",0,null,"","","","","","","","","","","","","","","",""]
[{"$f":"'Week 1'!A91","v":"<Enter Participant 81>"},null,null,null,null,null,null,null,null,null,null,null,null,null,null,null,null,null,"pts",0,1,"","",0,null,"","","","","","","","","","","","","","","",""]
[{"$f":"'Week 1'!A92","v":"<Enter Participant 82>"},null,null,null,null,null,null,null,null,null,null,null,null,null,null,null,null,null,"pts",0,1,"","",0,null,"","","","","","","","","","","","","","","",""]
[{"$f":"'Week 1'!A93","v":"<Enter Participant 83>"},null,null,null,null,null,null,null,null,null,null,null,null,null,null,null,null,null,"pts",0,1,"","",0,null,"","","","","","","","","","","","","","","",""]
[{"$f":"'Week 1'!A94","v":"<Enter Participant 84>"},null,null,null,null,null,null,null,null,null,null,null,null,null,null,null,null,null,"pts",0,1,"","",0,null,{"$f":"IF(ISBLANK(B$6),\"\",IF(B94=B$6,1,0))","v":""},"","","","","","","","","","","","","","",""]
[{"$f":"'Week 1'!A95","v":"<Enter Participant 85>"},null,null,null,null,null,null,null,null,null,null,null,null,null,null,null,null,null,"pts",0,1,"","",0,null,"","","","","","","","","","","","","","","",""]
[{"$f":"'Week 1'!A96","v":"<Enter Participant 86>"},null,null,null,null,null,null,null,null,null,null,null,null,null,null,null,null,null,"pts",0,1,"","",0,null,"","","","","","","","","","","","","","","",""]
[{"$f":"'Week 1'!A97","v":"<Enter Participant 87>"},null,null,null,null,null,null,null,null,null,null,null,null,null,null,null,null,null,"pts",0,1,"","",0,null,"","","","","","","","","","","","","","","",""]
[{"$f":"'Week 1'!A98","v":"<Enter Participant 88>"},null,null,null,null,null,null,null,null,null,null,null,null,null,null,null,null,null,"pts",0,1,"","",0,null,"","","","","","","","","","","","","","","",""]
[{"$f":"'Week 1'!A99","v":"<Enter Participant 89>"},null,null,null,null,null,null,null,null,null,null,null,null,null,null,null,null,null,"pts",0,1,"","",0,null,"","","","","","","","","","","","","","","",""]
[{"$f":"'Week 1'!A100","v":"<Enter Participant 90>"},null,null,null,null,null,null,null,null,null,null,null,null,null,null,null,null,null,"pts",0,1,"","",0,null,"","","","","","","","","","","","","","","",""]
[{"$f":"'Week 1'!A101","v":"<Enter Participant 91>"},null,null,null,null,null,null,null,null,null,null,null,null,null,null,null,null,null,"pts",0,1,"","",0,null,"","","","","","","","","","","","","","","",""]
[{"$f":"'Week 1'!A102","v":"<Enter Participant 92>"},null,null,null,null,null,null,null,null,null,null,null,null,null,null,null,null,null,"pts",0,1,"","",0,null,"","","","","","","","","","","","","","","",""]
[{"$f":"'Week 1'!A103","v":"<Enter Participant 93>"},null,null,null,null,null,null,null,null,null,null,null,null,null,null,null,null,null,"pts",0,1,"","",0,null,"","","","","","","","","","","","","","","",""]
[{"$f":"'Week 1'!A104","v":"<Enter Participant 94>"},null,null,null,null,null,null,null,null,null,null,null,null,null,null,null,null,null,"pts",0,1,"","",0,null,"","","","","","","","","","","","","","","",""]
[{"$f":"'Week 1'!A105","v":"<Enter Participant 95>"},null,null,null,null,null,null,null,null,null,null,null,null,null,null,null,null,null,"pts",0,1,"","",0,null,"","","","","","","","","","","","","","","",""]
[{"$f":"'Week 1'!A106","v":"<Enter Participant 96>"},null,null,null,null,null,null,null,null,null,null,null,null,null,null,null,null,null,"pts",0,1,"","",0,null,"","","","","","","","","","","","","","","",""]
[{"$f":"'Week 1'!A107","v":"<Enter Participant 97>"},null,null,null,null,null,null,null,null,null,null,null,null,null,null,null,null,null,"pts",{"$f":"IF(SUM(Z107:AO107)=0,0,SUM(Z107:AO107))","v":0},1,"","",0,null,"","","","","","","","","","","","","","","",""]
[{"$f":"'Week 1'!A108","v":"<Enter Participant 98>"},null,null,null,null,null,null,null,null,null,null,null,null,null,null,null,null,null,"pts",0,1,"","",0,null,"","","","","","","","","","","","","","","",""]
[{"$f":"'Week 1'!A109","v":"<Enter Participant 99>"},null,null,null,null,null,null,null,null,null,null,null,null,null,null,null,null,null,"pts",0,1,"","",0,null,"","","","","","","","","","","","","","","",{"$f":"IF(ISBLANK(Q$6),\"\",IF(Q109=Q$6,1,0))","v":""}]
[{"$f":"'Week 1'!A110","v":"<Enter Participant 100>"},null,null,null,null,null,null,null,null,null,null,null,null,null,null,null,null,null,"pts",0,1,"","",0,null,{"$f":"IF(ISBLANK(B$6),\"\",IF(B110=B$6,1,0))","v":""},"","","","","","","","","","","","","","",""]

{"sheet":"Week 15","index":14,"n_rows":110,"n_cols":41,"rows_kept":110,"cut":false,"hidden":false,"merged":[[1,17,1,18],[1,19,3,23],[4,23,9,23],[9,17,9,18]]}
["Week Lookup Column Offset",2,3,4,5,6,7,8,9,10,11,12,13,14,15,16,17,null,null,null,null,null,null,{"$f":"MID(T2,FIND(\" \",T2)+1,2)*1+18","v":33}]
[null,"GAME 1","GAME 2","GAME 3","GAME 4","GAME 5","GAME 6","GAME 7","GAME 8","GAME 9","GAME 10","GAME 11","GAME 12","GAME 13","GAME 14","GAME 15","GAME 16","SCORE",null,"Week 15"]
["VISITOR",{"$f":"IF(VLOOKUP($T$2&\" Visitors\",SCHEDULE_TABLE,B$1,FALSE)=0,\"\",VLOOKUP($T$2&\" Visitors\",SCHEDULE_TABLE,B$1,FALSE))","v":"ARI"},"PIT","JAX","GB","TB","CIN","MIN","HOU","OAK","MIA","WAS","DEN","NYJ","SF","DAL","NO",null,"pts"]
[null,"at","at","at","at","at","at","at","at","at","at","at","at","at","at","at","at"]
["HOME",{"$f":"IF(VLOOKUP($T$2&\" Homes\",SCHEDULE_TABLE,B$1,FALSE)=0,\"\",VLOOKUP($T$2&\" Homes\",SCHEDULE_TABLE,B$1,FALSE))","v":"STL"},"ATL","BAL","BUF","CAR","CLE","DET","IND","KC","NE","NYG","SD","TEN","SEA","PHI","CHI",null,"pts",null,null,null,null,"TOTAL POINTS FOR YEAR"]
["WINNER",null,null,null,null,null,null,null,null,null,null,null,null,null,null,null,null,{"$f":"IF(R3+R5=0,\"\",R3+R5)","v":""},"pts"]
[null,{"$f":"B3","v":"ARI"},"PIT","JAX","GB","TB","CIN","MIN","HOU","OAK","MIA","WAS","DEN","NYJ","SF","DAL","NO"]
[null,{"$f":"B5","v":"STL"},"ATL","BAL","BUF","CAR","CLE","DET","IND","KC","NE","NYG","SD","TEN","SEA","PHI","CHI"]
[]
["NAME","PICKS","PICKS","PICKS","PICKS","PICKS","PICKS","PICKS","PICKS","PICKS","PICKS","PICKS","PICKS","PICKS","PICKS","PICKS","PICKS","TIE-BREAK",null,"PICK PTS","PTS RANK","ABS DIFF","TIE-BREAK"]
[{"$f":"'Week 1'!A11","v":"<Enter Participant 1>"},null,null,null,null,null,null,null,null,null,null,null,null,null,null,null,null,null,"pts",{"$f":"IF(SUM(Z11:AO11)=0,0,SUM(Z11:AO11))","v":0},{"$f":"IF(ISERROR(RANK(T11,$T$11:$T$85)),\"\",RANK(T11,$T$11:$T$85))","v":1},{"$f":"IF(ISBLANK(R11),\"\",IF(U11=1,ABS(R11-R$6),\"\"))","v":""},{"$f":"IF(ISERROR(RANK(V11,$V$11:$V$85,1)),\"\",RANK(V11,$V$11:$V$85,1))","v":""},{"$f":"VLOOKUP(A11,CUMULATIVE_TABLE,X$1,FALSE)","v":0},null,{"$f":"IF(ISBLANK(B$6),\"\",IF(B11=B$6,1,0))","v":""},"","","","","","","","","","","","","","",""]
[{"$f":"'Week 1'!A12","v":"<Enter Participant 2>"},null,null,null,null,null,null,null,null,null,null,null,null,null,null,null,null,null,"pts",0,1,"","",0,null,"","","","","","","","","","","","","","","",""]
[{"$f":"'Week 1'!A13","v":"<Enter Participant 3>"},null,null,null,null,null,null,null,null,null,null,null,null,null,null,null,null,null,"pts",0,1,"","",0,null,"","","","","","","","","","","","","","","",""]
[{"$f":"'Week 1'!A14","v":"<Enter Participant 4>"},null,null,null,null,null,null,null,null,null,null,null,null,null,null,null,null,null,"pts",0,1,"","",0,null,"","","","","","","","","","","","","","","",""]
[{"$f":"'Week 1'!A15","v":"<Enter Participant 5>"},null,null,null,null,null,null,null,null,null,null,null,null,null,null,null,null,null,"pts",0,1,"","",0,null,"","","","","","","","","","","","","","","",""]
[{"$f":"'Week 1'!A16","v":"<Enter Participant 6>"},null,null,null,null,null,null,null,null,null,null,null,null,null,null,null,null,null,"pts",0,1,"","",0,null,"","","","","","","","","","","","","","","",""]
[{"$f":"'Week 1'!A17","v":"<Enter Participant 7>"},null,null,null,null,null,null,null,null,null,null,null,null,null,null,null,null,null,"pts",0,1,"","",0,null,"","","","","","","","","","","","","","","",""]
[{"$f":"'Week 1'!A18","v":"<Enter Participant 8>"},null,null,null,null,null,null,null,null,null,null,null,null,null,null,null,null,null,"pts",0,1,"","",0,null,"","","","","","","","","","","","","","","",""]
[{"$f":"'Week 1'!A19","v":"<Enter Participant 9>"},null,null,null,null,null,null,null,null,null,null,null,null,null,null,null,null,null,"pts",0,1,"","",0,null,"","","","","","","","","","","","","","","",""]
[{"$f":"'Week 1'!A20","v":"<Enter Participant 10>"},null,null,null,null,null,null,null,null,null,null,null,null,null,null,null,null,null,"pts",0,1,"","",0,null,"","","","","","","","","","","","","","","",""]
[{"$f":"'Week 1'!A21","v":"<Enter Participant 11>"},null,null,null,null,null,null,null,null,null,null,null,null,null,null,null,null,null,"pts",0,1,"","",0,null,"","","","","","","","","","","","","","","",""]
[{"$f":"'Week 1'!A22","v":"<Enter Participant 12>"},null,null,null,null,null,null,null,null,null,null,null,null,null,null,null,null,null,"pts",0,1,"","",0,null,"","","","","","","","","","","","","","","",""]
[{"$f":"'Week 1'!A23","v":"<Enter Participant 13>"},null,null,null,null,null,null,null,null,null,null,null,null,null,null,null,null,null,"pts",0,1,"","",0,null,"","","","","","","","","","","","","","","",""]
[{"$f":"'Week 1'!A24","v":"<Enter Participant 14>"},null,null,null,null,null,null,null,null,null,null,null,null,null,null,null,null,null,"pts",0,1,"","",0,null,"","","","","","","","","","","","","","","",""]
[{"$f":"'Week 1'!A25","v":"<Enter Participant 15>"},null,null,null,null,null,null,null,null,null,null,null,null,null,null,null,null,null,"pts",0,1,"","",0,null,"","","","","","","","","","","","","","","",""]
[{"$f":"'Week 1'!A26","v":"<Enter Participant 16>"},null,null,null,null,null,null,null,null,null,null,null,null,null,null,null,null,null,"pts",0,1,"","",0,null,"","","","","","","","","","","","","","","",{"$f":"IF(ISBLANK(Q$6),\"\",IF(Q26=Q$6,1,0))","v":""}]
[{"$f":"'Week 1'!A27","v":"<Enter Participant 17>"},null,null,null,null,null,null,null,null,null,null,null,null,null,null,null,null,null,"pts",0,1,"","",0,null,{"$f":"IF(ISBLANK(B$6),\"\",IF(B27=B$6,1,0))","v":""},"","","","","","","","","","","","","","",""]
[{"$f":"'Week 1'!A28","v":"<Enter Participant 18>"},null,null,null,null,null,null,null,null,null,null,null,null,null,null,null,null,null,"pts",0,1,"","",0,null,"","","","","","","","","","","","","","","",""]
[{"$f":"'Week 1'!A29","v":"<Enter Participant 19>"},null,null,null,null,null,null,null,null,null,null,null,null,null,null,null,null,null,"pts",0,1,"","",0,null,"","","","","","","","","","","","","","","",""]
[{"$f":"'Week 1'!A30","v":"<Enter Participant 20>"},null,null,null,null,null,null,null,null,null,null,null,null,null,null,null,null,null,"pts",0,1,"","",0,null,"","","","","","","","","","","","","","","",""]
[{"$f":"'Week 1'!A31","v":"<Enter Participant 21>"},null,null,null,null,null,null,null,null,null,null,null,null,null,null,null,null,null,"pts",0,1,"","",0,null,"","","","","","","","","","","","","","","",""]
[{"$f":"'Week 1'!A32","v":"<Enter Participant 22>"},null,null,null,null,null,null,null,null,null,null,null,null,null,null,null,null,null,"pts",0,1,"","",0,null,"","","","","","","","","","","","","","","",""]
[{"$f":"'Week 1'!A33","v":"<Enter Participant 23>"},null,null,null,null,null,null,null,null,null,null,null,null,null,null,null,null,null,"pts",0,1,"","",0,null,"","","","","","","","","","","","","","","",""]
[{"$f":"'Week 1'!A34","v":"<Enter Participant 24>"},null,null,null,null,null,null,null,null,null,null,null,null,null,null,null,null,null,"pts",0,1,"","",0,null,"","","","","","","","","","","","","","","",""]
[{"$f":"'Week 1'!A35","v":"<Enter Participant 25>"},null,null,null,null,null,null,null,null,null,null,null,null,null,null,null,null,null,"pts",0,1,"","",0,null,"","","","","","","","","","","","","","","",""]
[{"$f":"'Week 1'!A36","v":"<Enter Participant 26>"},null,null,null,null,null,null,null,null,null,null,null,null,null,null,null,null,null,"pts",0,1,"","",0,null,"","","","","","","","","","","","","","","",""]
[{"$f":"'Week 1'!A37","v":"<Enter Participant 27>"},null,null,null,null,null,null,null,null,null,null,null,null,null,null,null,null,null,"pts",0,1,"","",0,null,"","","","","","","","","","","","","","","",""]
[{"$f":"'Week 1'!A38","v":"<Enter Participant 28>"},null,null,null,null,null,null,null,null,null,null,null,null,null,null,null,null,null,"pts",0,1,"","",0,null,"","","","","","","","","","","","","","","",""]
[{"$f":"'Week 1'!A39","v":"<Enter Participant 29>"},null,null,null,null,null,null,null,null,null,null,null,null,null,null,null,null,null,"pts",0,1,"","",0,null,"","","","","","","","","","","","","","","",""]
[{"$f":"'Week 1'!A40","v":"<Enter Participant 30>"},null,null,null,null,null,null,null,null,null,null,null,null,null,null,null,null,null,"pts",0,1,"","",0,null,"","","","","","","","","","","","","","","",""]
[{"$f":"'Week 1'!A41","v":"<Enter Participant 31>"},null,null,null,null,null,null,null,null,null,null,null,null,null,null,null,null,null,"pts",0,1,"","",0,null,"","","","","","","","","","","","","","","",""]
[{"$f":"'Week 1'!A42","v":"<Enter Participant 32>"},null,null,null,null,null,null,null,null,null,null,null,null,null,null,null,null,null,"pts",0,1,"","",0,null,"","","","","","","","","","","","","","","",""]
[{"$f":"'Week 1'!A43","v":"<Enter Participant 33>"},null,null,null,null,null,null,null,null,null,null,null,null,null,null,null,null,null,"pts",{"$f":"IF(SUM(Z43:AO43)=0,0,SUM(Z43:AO43))","v":0},1,"","",{"$f":"VLOOKUP(A43,CUMULATIVE_TABLE,X$1,FALSE)","v":0},null,"","","","","","","","","","","","","","","",""]
[{"$f":"'Week 1'!A44","v":"<Enter Participant 34>"},null,null,null,null,null,null,null,null,null,null,null,null,null,null,null,null,null,"pts",0,1,"","",0,null,{"$f":"IF(ISBLANK(B$6),\"\",IF(B44=B$6,1,0))","v":""},"","","","","","","","","","","","","","",""]
[{"$f":"'Week 1'!A45","v":"<Enter Participant 35>"},null,null,null,null,null,null,null,null,null,null,null,null,null,null,null,null,null,"pts",0,1,"","",0,null,"","","","","","","","","","","","","","","",""]
[{"$f":"'Week 1'!A46","v":"<Enter Participant 36>"},null,null,null,null,null,null,null,null,null,null,null,null,null,null,null,null,null,"pts",0,1,"","",0,null,"","","","","","","","","","","","","","","",""]
[{"$f":"'Week 1'!A47","v":"<Enter Participant 37>"},null,null,null,null,null,null,null,null,null,null,null,null,null,null,null,null,null,"pts",0,1,"","",0,null,"","","","","","","","","","","","","","","",""]
[{"$f":"'Week 1'!A48","v":"<Enter Participant 38>"},null,null,null,null,null,null,null,null,null,null,null,null,null,null,null,null,null,"pts",0,1,"","",0,null,"","","","","","","","","","","","","","","",""]
[{"$f":"'Week 1'!A49","v":"<Enter Participant 39>"},null,null,null,null,null,null,null,null,null,null,null,null,null,null,null,null,null,"pts",0,1,"","",0,null,"","","","","","","","","","","","","","","",""]
[{"$f":"'Week 1'!A50","v":"<Enter Participant 40>"},null,null,null,null,null,null,null,null,null,null,null,null,null,null,null,null,null,"pts",0,1,"","",0,null,"","","","","","","","","","","","","","","",""]
[{"$f":"'Week 1'!A51","v":"<Enter Participant 41>"},null,null,null,null,null,null,null,null,null,null,null,null,null,null,null,null,null,"pts",0,1,"","",0,null,"","","","","","","","","","","","","","","",""]
[{"$f":"'Week 1'!A52","v":"<Enter Participant 42>"},null,null,null,null,null,null,null,null,null,null,null,null,null,null,null,null,null,"pts",0,1,"","",0,null,"","","","","","","","","","","","","","","",""]
[{"$f":"'Week 1'!A53","v":"<Enter Participant 43>"},null,null,null,null,null,null,null,null,null,null,null,null,null,null,null,null,null,"pts",0,1,"","",0,null,"","","","","","","","","","","","","","","",""]
[{"$f":"'Week 1'!A54","v":"<Enter Participant 44>"},null,null,null,null,null,null,null,null,null,null,null,null,null,null,null,null,null,"pts",0,1,"","",0,null,"","","","","","","","","","","","","","","",""]
[{"$f":"'Week 1'!A55","v":"<Enter Participant 45>"},null,null,null,null,null,null,null,null,null,null,null,null,null,null,null,null,null,"pts",0,1,"","",0,null,"","","","","","","","","","","","","","","",""]
[{"$f":"'Week 1'!A56","v":"<Enter Participant 46>"},null,null,null,null,null,null,null,null,null,null,null,null,null,null,null,null,null,"pts",0,1,"","",0,null,"","","","","","","","","","","","","","","",""]
[{"$f":"'Week 1'!A57","v":"<Enter Participant 47>"},null,null,null,null,null,null,null,null,null,null,null,null,null,null,null,null,null,"pts",0,1,"","",0,null,"","","","","","","","","","","","","","","",""]
[{"$f":"'Week 1'!A58","v":"<Enter Participant 48>"},null,null,null,null,null,null,null,null,null,null,null,null,null,null,null,null,null,"pts",0,1,"","",0,null,"","","","","","","","","","","","","","","",""]
[{"$f":"'Week 1'!A59","v":"<Enter Participant 49>"},null,null,null,null,null,null,null,null,null,null,null,null,null,null,null,null,null,"pts",0,1,"","",0,null,"","","","","","","","","","","","","","","",""]
[{"$f":"'Week 1'!A60","v":"<Enter Participant 50>"},null,null,null,null,null,null,null,null,null,null,null,null,null,null,null,null,null,"pts",0,1,"","",0,null,"","","","","","","","","","","","","","","",""]
[{"$f":"'Week 1'!A61","v":"<Enter Participant 51>"},null,null,null,null,null,null,null,null,null,null,null,null,null,null,null,null,null,"pts",0,1,"","",0,null,{"$f":"IF(ISBLANK(B$6),\"\",IF(B61=B$6,1,0))","v":""},"","","","","","","","","","","","","","",""]
[{"$f":"'Week 1'!A62","v":"<Enter Participant 52>"},null,null,null,null,null,null,null,null,null,null,null,null,null,null,null,null,null,"pts",0,1,"","",0,null,"","","","","","","","","","","","","","","",""]
[{"$f":"'Week 1'!A63","v":"<Enter Participant 53>"},null,null,null,null,null,null,null,null,null,null,null,null,null,null,null,null,null,"pts",0,1,"","",0,null,"","","","","","","","","","","","","","","",""]
[{"$f":"'Week 1'!A64","v":"<Enter Participant 54>"},null,null,null,null,null,null,null,null,null,null,null,null,null,null,null,null,null,"pts",0,1,"","",0,null,"","","","","","","","","","","","","","","",""]
[{"$f":"'Week 1'!A65","v":"<Enter Participant 55>"},null,null,null,null,null,null,null,null,null,null,null,null,null,null,null,null,null,"pts",0,1,"","",0,null,"","","","","","","","","","","","","","","",""]
[{"$f":"'Week 1'!A66","v":"<Enter Participant 56>"},null,null,null,null,null,null,null,null,null,null,null,null,null,null,null,null,null,"pts",0,1,"","",0,null,"","","","","","","","","","","","","","","",""]
[{"$f":"'Week 1'!A67","v":"<Enter Participant 57>"},null,null,null,null,null,null,null,null,null,null,null,null,null,null,null,null,null,"pts",0,1,"","",0,null,"","","","","","","","","","","","","","","",""]
[{"$f":"'Week 1'!A68","v":"<Enter Participant 58>"},null,null,null,null,null,null,null,null,null,null,null,null,null,null,null,null,null,"pts",0,1,"","",0,null,"","","","","","","","","","","","","","","",""]
[{"$f":"'Week 1'!A69","v":"<Enter Participant 59>"},null,null,null,null,null,null,null,null,null,null,null,null,null,null,null,null,null,"pts",0,1,"","",0,null,"","","","","","","","","","","","","","","",""]
[{"$f":"'Week 1'!A70","v":"<Enter Participant 60>"},null,null,null,null,null,null,null,null,null,null,null,null,null,null,null,null,null,"pts",0,1,"","",0,null,"","","","","","","","","","","","","","","",""]
[{"$f":"'Week 1'!A71","v":"<Enter Participant 61>"},null,null,null,null,null,null,null,null,null,null,null,null,null,null,null,null,null,"pts",0,1,"","",0,null,"","","","","","","","","","","","","","","",""]
[{"$f":"'Week 1'!A72","v":"<Enter Participant 62>"},null,null,null,null,null,null,null,null,null,null,null,null,null,null,null,null,null,"pts",0,1,"","",0,null,"","","","","","","","","","","","","","","",""]
[{"$f":"'Week 1'!A73","v":"<Enter Participant 63>"},null,null,null,null,null,null,null,null,null,null,null,null,null,null,null,null,null,"pts",0,1,"","",0,null,"","","","","","","","","","","","","","","",""]
[{"$f":"'Week 1'!A74","v":"<Enter Participant 64>"},null,null,null,null,null,null,null,null,null,null,null,null,null,null,null,null,null,"pts",0,1,"","",0,null,"","","","","","","","","","","","","","","",""]
[{"$f":"'Week 1'!A75","v":"<Enter Participant 65>"},null,null,null,null,null,null,null,null,null,null,null,null,null,null,null,null,null,"pts",0,{"$f":"IF(ISERROR(RANK(T75,$T$11:$T$85)),\"\",RANK(T75,$T$11:$T$85))","v":1},{"$f":"IF(ISBLANK(R75),\"\",IF(U75=1,ABS(R75-R$6),\"\"))","v":""},{"$f":"IF(ISERROR(RANK(V75,$V$11:$V$85,1)),\"\",RANK(V75,$V$11:$V$85,1))","v":""},{"$f":"VLOOKUP(A75,CUMULATIVE_TABLE,X$1,FALSE)","v":0},null,"","","","","","","","","","","","","","","",""]
[{"$f":"'Week 1'!A76","v":"<Enter Participant 66>"},null,null,null,null,null,null,null,null,null,null,null,null,null,null,null,null,null,"pts",0,1,"","",0,null,"","","","","","","","","","","","","","","",""]
[{"$f":"'Week 1'!A77","v":"<Enter Participant 67>"},null,null,null,null,null,null,null,null,null,null,null,null,null,null,null,null,null,"pts",0,1,"","",0,null,"","","","","","","","","","","","","","","",""]
[{"$f":"'Week 1'!A78","v":"<Enter Participant 68>"},null,null,null,null,null,null,null,null,null,null,null,null,null,null,null,null,null,"pts",0,1,"","",0,null,{"$f":"IF(ISBLANK(B$6),\"\",IF(B78=B$6,1,0))","v":""},"","","","","","","","","","","","","","",""]
[{"$f":"'Week 1'!A79","v":"<Enter Participant 69>"},null,null,null,null,null,null,null,null,null,null,null,null,null,null,null,null,null,"pts",0,1,"","",0,null,"","","","","","","","","","","","","","","",""]
[{"$f":"'Week 1'!A80","v":"<Enter Participant 70>"},null,null,null,null,null,null,null,null,null,null,null,null,null,null,null,null,null,"pts",0,1,"","",0,null,"","","","","","","","","","","","","","","",""]
[{"$f":"'Week 1'!A81","v":"<Enter Participant 71>"},null,null,null,null,null,null,null,null,null,null,null,null,null,null,null,null,null,"pts",0,1,"","",0,null,"","","","","","","","","","","","","","","",""]
[{"$f":"'Week 1'!A82","v":"<Enter Participant 72>"},null,null,null,null,null,null,null,null,null,null,null,null,null,null,null,null,null,"pts",0,1,"","",0,null,"","","","","","","","","","","","","","","",""]
[{"$f":"'Week 1'!A83","v":"<Enter Participant 73>"},null,null,null,null,null,null,null,null,null,null,null,null,null,null,null,null,null,"pts",0,1,"","",0,null,"","","","","","","","","","","","","","","",""]
[{"$f":"'Week 1'!A84","v":"<Enter Participant 74>"},null,null,null,null,null,null,null,null,null,null,null,null,null,null,null,null,null,"pts",0,1,"","",0,null,"","","","","","","","","","","","","","","",""]
[{"$f":"'Week 1'!A85","v":"<Enter Participant 75>"},null,null,null,null,null,null,null,null,null,null,null,null,null,null,null,null,null,"pts",0,1,"","",0,null,"","","","","","","","","","","","","","","",""]
[{"$f":"'Week 1'!A86","v":"<Enter Participant 76>"},null,null,null,null,null,null,null,null,null,null,null,null,null,null,null,null,null,"pts",0,1,"","",0,null,"","","","","","","","","","","","","","","",""]
[{"$f":"'Week 1'!A87","v":"<Enter Participant 77>"},null,null,null,null,null,null,null,null,null,null,null,null,null,null,null,null,null,"pts",0,1,"","",0,null,"","","","","","","","","","","","","","","",""]
[{"$f":"'Week 1'!A88","v":"<Enter Participant 78>"},null,null,null,null,null,null,null,null,null,null,null,null,null,null,null,null,null,"pts",0,1,"","",0,null,"","","","","","","","","","","","","","","",""]
[{"$f":"'Week 1'!A89","v":"<Enter Participant 79>"},null,null,null,null,null,null,null,null,null,null,null,null,null,null,null,null,null,"pts",0,1,"","",0,null,"","","","","","","","","","","","","","","",""]
[{"$f":"'Week 1'!A90","v":"<Enter Participant 80>"},null,null,null,null,null,null,null,null,null,null,null,null,null,null,null,null,null,"pts",0,1,"","",0,null,"","","","","","","","","","","","","","","",""]
[{"$f":"'Week 1'!A91","v":"<Enter Participant 81>"},null,null,null,null,null,null,null,null,null,null,null,null,null,null,null,null,null,"pts",0,1,"","",0,null,"","","","","","","","","","","","","","","",""]
[{"$f":"'Week 1'!A92","v":"<Enter Participant 82>"},null,null,null,null,null,null,null,null,null,null,null,null,null,null,null,null,null,"pts",0,1,"","",0,null,"","","","","","","","","","","","","","","",""]
[{"$f":"'Week 1'!A93","v":"<Enter Participant 83>"},null,null,null,null,null,null,null,null,null,null,null,null,null,null,null,null,null,"pts",0,1,"","",0,null,"","","","","","","","","","","","","","","",""]
[{"$f":"'Week 1'!A94","v":"<Enter Participant 84>"},null,null,null,null,null,null,null,null,null,null,null,null,null,null,null,null,null,"pts",0,1,"","",0,null,{"$f":"IF(ISBLANK(B$6),\"\",IF(B94=B$6,1,0))","v":""},"","","","","","","","","","","","","","",""]
[{"$f":"'Week 1'!A95","v":"<Enter Participant 85>"},null,null,null,null,null,null,null,null,null,null,null,null,null,null,null,null,null,"pts",0,1,"","",0,null,"","","","","","","","","","","","","","","",""]
[{"$f":"'Week 1'!A96","v":"<Enter Participant 86>"},null,null,null,null,null,null,null,null,null,null,null,null,null,null,null,null,null,"pts",0,1,"","",0,null,"","","","","","","","","","","","","","","",""]
[{"$f":"'Week 1'!A97","v":"<Enter Participant 87>"},null,null,null,null,null,null,null,null,null,null,null,null,null,null,null,null,null,"pts",0,1,"","",0,null,"","","","","","","","","","","","","","","",""]
[{"$f":"'Week 1'!A98","v":"<Enter Participant 88>"},null,null,null,null,null,null,null,null,null,null,null,null,null,null,null,null,null,"pts",0,1,"","",0,null,"","","","","","","","","","","","","","","",""]
[{"$f":"'Week 1'!A99","v":"<Enter Participant 89>"},null,null,null,null,null,null,null,null,null,null,null,null,null,null,null,null,null,"pts",0,1,"","",0,null,"","","","","","","","","","","","","","","",""]
[{"$f":"'Week 1'!A100","v":"<Enter Participant 90>"},null,null,null,null,null,null,null,null,null,null,null,null,null,null,null,null,null,"pts",0,1,"","",0,null,"","","","","","","","","","","","","","","",""]
[{"$f":"'Week 1'!A101","v":"<Enter Participant 91>"},null,null,null,null,null,null,null,null,null,null,null,null,null,null,null,null,null,"pts",0,1,"","",0,null,"","","","","","","","","","","","","","","",""]
[{"$f":"'Week 1'!A102","v":"<Enter Participant 92>"},null,null,null,null,null,null,null,null,null,null,null,null,null,null,null,null,null,"pts",0,1,"","",0,null,"","","","","","","","","","","","","","","",""]
[{"$f":"'Week 1'!A103","v":"<Enter Participant 93>"},null,null,null,null,null,null,null,null,null,null,null,null,null,null,null,null,null,"pts",0,1,"","",0,null,"","","","","","","","","","","","","","","",""]
[{"$f":"'Week 1'!A104","v":"<Enter Participant 94>"},null,null,null,null,null,null,null,null,null,null,null,null,null,null,null,null,null,"pts",0,1,"","",0,null,"","","","","","","","","","","","","","","",""]
[{"$f":"'Week 1'!A105","v":"<Enter Participant 95>"},null,null,null,null,null,null,null,null,null,null,null,null,null,null,null,null,null,"pts",0,1,"","",0,null,"","","","","","","","","","","","","","","",""]
[{"$f":"'Week 1'!A106","v":"<Enter Participant 96>"},null,null,null,null,null,null,null,null,null,null,null,null,null,null,null,null,null,"pts",0,1,"","",0,null,"","","","","","","","","","","","","","","",""]
[{"$f":"'Week 1'!A107","v":"<Enter Participant 97>"},null,null,null,null,null,null,null,null,null,null,null,null,null,null,null,null,null,"pts",{"$f":"IF(SUM(Z107:AO107)=0,0,SUM(Z107:AO107))","v":0},1,"","",0,null,"","","","","","","","","","","","","","","",""]
[{"$f":"'Week 1'!A108","v":"<Enter Participant 98>"},null,null,null,null,null,null,null,null,null,null,null,null,null,null,null,null,null,"pts",0,1,"","",0,null,"","","","","","","","","","","","","","","",""]
[{"$f":"'Week 1'!A109","v":"<Enter Participant 99>"},null,null,null,null,null,null,null,null,null,null,null,null,null,null,null,null,null,"pts",0,1,"","",0,null,"","","","","","","","","","","","","","","",{"$f":"IF(ISBLANK(Q$6),\"\",IF(Q109=Q$6,1,0))","v":""}]
[{"$f":"'Week 1'!A110","v":"<Enter Participant 100>"},null,null,null,null,null,null,null,null,null,null,null,null,null,null,null,null,null,"pts",0,1,"","",0,null,{"$f":"IF(ISBLANK(B$6),\"\",IF(B110=B$6,1,0))","v":""},"","","","","","","","","","","","","","",""]

{"sheet":"Week 16","index":15,"n_rows":110,"n_cols":41,"rows_kept":110,"cut":false,"hidden":false,"merged":[[1,17,1,18],[1,19,3,23],[4,23,9,23],[9,17,9,18]]}
["Week Lookup Column Offset",2,3,4,5,6,7,8,9,10,11,12,13,14,15,16,17,null,null,null,null,null,null,{"$f":"MID(T2,FIND(\" \",T2)+1,2)*1+18","v":34}]
[null,"GAME 1","GAME 2","GAME 3","GAME 4","GAME 5","GAME 6","GAME 7","GAME 8","GAME 9","GAME 10","GAME 11","GAME 12","GAME 13","GAME 14","GAME 15","GAME 16","SCORE",null,"Week 16"]
["VISITOR",{"$f":"IF(VLOOKUP($T$2&\" Visitors\",SCHEDULE_TABLE,B$1,FALSE)=0,\"\",VLOOKUP($T$2&\" Visitors\",SCHEDULE_TABLE,B$1,FALSE))","v":"TEN"},"SD","PHI","CLE","DET","BAL","MIN","ATL","NE","KC","GB","NYG","IND","BUF","SEA","DEN",null,"pts"]
[null,"at","at","at","at","at","at","at","at","at","at","at","at","at","at","at","at"]
["HOME",{"$f":"IF(VLOOKUP($T$2&\" Homes\",SCHEDULE_TABLE,B$1,FALSE)=0,\"\",VLOOKUP($T$2&\" Homes\",SCHEDULE_TABLE,B$1,FALSE))","v":"JAX"},"SF","WAS","CAR","CHI","HOU","MIA","NO","NYJ","PIT","TB","STL","DAL","OAK","ARI","CIN",null,"pts",null,null,null,null,"TOTAL POINTS FOR YEAR"]
["WINNER",null,null,null,null,null,null,null,null,null,null,null,null,null,null,null,null,{"$f":"IF(R3+R5=0,\"\",R3+R5)","v":""},"pts"]
[null,{"$f":"B3","v":"TEN"},"SD","PHI","CLE","DET","BAL","MIN","ATL","NE","KC","GB","NYG","IND","BUF","SEA","DEN"]
[null,{"$f":"B5","v":"JAX"},"SF","WAS","CAR","CHI","HOU","MIA","NO","NYJ","PIT","TB","STL","DAL","OAK","ARI","CIN"]
[]
["NAME","PICKS","PICKS","PICKS","PICKS","PICKS","PICKS","PICKS","PICKS","PICKS","PICKS","PICKS","PICKS","PICKS","PICKS","PICKS","PICKS","TIE-BREAK",null,"PICK PTS","PTS RANK","ABS DIFF","TIE-BREAK"]
[{"$f":"'Week 1'!A11","v":"<Enter Participant 1>"},null,null,null,null,null,null,null,null,null,null,null,null,null,null,null,null,null,"pts",{"$f":"IF(SUM(Z11:AO11)=0,0,SUM(Z11:AO11))","v":0},{"$f":"IF(ISERROR(RANK(T11,$T$11:$T$85)),\"\",RANK(T11,$T$11:$T$85))","v":1},{"$f":"IF(ISBLANK(R11),\"\",IF(U11=1,ABS(R11-R$6),\"\"))","v":""},{"$f":"IF(ISERROR(RANK(V11,$V$11:$V$85,1)),\"\",RANK(V11,$V$11:$V$85,1))","v":""},{"$f":"VLOOKUP(A11,CUMULATIVE_TABLE,X$1,FALSE)","v":0},null,{"$f":"IF(ISBLANK(B$6),\"\",IF(B11=B$6,1,0))","v":""},"","","","","","","","","","","","","","",""]
[{"$f":"'Week 1'!A12","v":"<Enter Participant 2>"},null,null,null,null,null,null,null,null,null,null,null,null,null,null,null,null,null,"pts",0,1,"","",0,null,"","","","","","","","","","","","","","","",""]
[{"$f":"'Week 1'!A13","v":"<Enter Participant 3>"},null,null,null,null,null,null,null,null,null,null,null,null,null,null,null,null,null,"pts",0,1,"","",0,null,"","","","","","","","","","","","","","","",""]
[{"$f":"'Week 1'!A14","v":"<Enter Participant 4>"},null,null,null,null,null,null,null,null,null,null,null,null,null,null,null,null,null,"pts",0,1,"","",0,null,"","","","","","","","","","","","","","","",""]
[{"$f":"'Week 1'!A15","v":"<Enter Participant 5>"},null,null,null,null,null,null,null,null,null,null,null,null,null,null,null,null,null,"pts",0,1,"","",0,null,"","","","","","","","","","","","","","","",""]
[{"$f":"'Week 1'!A16","v":"<Enter Participant 6>"},null,null,null,null,null,null,null,null,null,null,null,null,null,null,null,null,null,"pts",0,1,"","",0,null,"","","","","","","","","","","","","","","",""]
[{"$f":"'Week 1'!A17","v":"<Enter Participant 7>"},null,null,null,null,null,null,null,null,null,null,null,null,null,null,null,null,null,"pts",0,1,"","",0,null,"","","","","","","","","","","","","","","",""]
[{"$f":"'Week 1'!A18","v":"<Enter Participant 8>"},null,null,null,null,null,null,null,null,null,null,null,null,null,null,null,null,null,"pts",0,1,"","",0,null,"","","","","","","","","","","","","","","",""]
[{"$f":"'Week 1'!A19","v":"<Enter Participant 9>"},null,null,null,null,null,null,null,null,null,null,null,null,null,null,null,null,null,"pts",0,1,"","",0,null,"","","","","","","","","","","","","","","",""]
[{"$f":"'Week 1'!A20","v":"<Enter Participant 10>"},null,null,null,null,null,null,null,null,null,null,null,null,null,null,null,null,null,"pts",0,1,"","",0,null,"","","","","","","","","","","","","","","",""]
[{"$f":"'Week 1'!A21","v":"<Enter Participant 11>"},null,null,null,null,null,null,null,null,null,null,null,null,null,null,null,null,null,"pts",0,1,"","",0,null,"","","","","","","","","","","","","","","",""]
[{"$f":"'Week 1'!A22","v":"<Enter Participant 12>"},null,null,null,null,null,null,null,null,null,null,null,null,null,null,null,null,null,"pts",0,1,"","",0,null,"","","","","","","","","","","","","","","",""]
[{"$f":"'Week 1'!A23","v":"<Enter Participant 13>"},null,null,null,null,null,null,null,null,null,null,null,null,null,null,null,null,null,"pts",0,1,"","",0,null,"","","","","","","","","","","","","","","",""]
[{"$f":"'Week 1'!A24","v":"<Enter Participant 14>"},null,null,null,null,null,null,null,null,null,null,null,null,null,null,null,null,null,"pts",0,1,"","",0,null,"","","","","","","","","","","","","","","",""]
[{"$f":"'Week 1'!A25","v":"<Enter Participant 15>"},null,null,null,null,null,null,null,null,null,null,null,null,null,null,null,null,null,"pts",0,1,"","",0,null,"","","","","","","","","","","","","","","",""]
[{"$f":"'Week 1'!A26","v":"<Enter Participant 16>"},null,null,null,null,null,null,null,null,null,null,null,null,null,null,null,null,null,"pts",0,1,"","",0,null,"","","","","","","","","","","","","","","",{"$f":"IF(ISBLANK(Q$6),\"\",IF(Q26=Q$6,1,0))","v":""}]
[{"$f":"'Week 1'!A27","v":"<Enter Participant 17>"},null,null,null,null,null,null,null,null,null,null,null,null,null,null,null,null,null,"pts",0,1,"","",0,null,{"$f":"IF(ISBLANK(B$6),\"\",IF(B27=B$6,1,0))","v":""},"","","","","","","","","","","","","","",""]
[{"$f":"'Week 1'!A28","v":"<Enter Participant 18>"},null,null,null,null,null,null,null,null,null,null,null,null,null,null,null,null,null,"pts",0,1,"","",0,null,"","","","","","","","","","","","","","","",""]
[{"$f":"'Week 1'!A29","v":"<Enter Participant 19>"},null,null,null,null,null,null,null,null,null,null,null,null,null,null,null,null,null,"pts",0,1,"","",0,null,"","","","","","","","","","","","","","","",""]
[{"$f":"'Week 1'!A30","v":"<Enter Participant 20>"},null,null,null,null,null,null,null,null,null,null,null,null,null,null,null,null,null,"pts",0,1,"","",0,null,"","","","","","","","","","","","","","","",""]
[{"$f":"'Week 1'!A31","v":"<Enter Participant 21>"},null,null,null,null,null,null,null,null,null,null,null,null,null,null,null,null,null,"pts",0,1,"","",0,null,"","","","","","","","","","","","","","","",""]
[{"$f":"'Week 1'!A32","v":"<Enter Participant 22>"},null,null,null,null,null,null,null,null,null,null,null,null,null,null,null,null,null,"pts",0,1,"","",0,null,"","","","","","","","","","","","","","","",""]
[{"$f":"'Week 1'!A33","v":"<Enter Participant 23>"},null,null,null,null,null,null,null,null,null,null,null,null,null,null,null,null,null,"pts",0,1,"","",0,null,"","","","","","","","","","","","","","","",""]
[{"$f":"'Week 1'!A34","v":"<Enter Participant 24>"},null,null,null,null,null,null,null,null,null,null,null,null,null,null,null,null,null,"pts",0,1,"","",0,null,"","","","","","","","","","","","","","","",""]
[{"$f":"'Week 1'!A35","v":"<Enter Participant 25>"},null,null,null,null,null,null,null,null,null,null,null,null,null,null,null,null,null,"pts",0,1,"","",0,null,"","","","","","","","","","","","","","","",""]
[{"$f":"'Week 1'!A36","v":"<Enter Participant 26>"},null,null,null,null,null,null,null,null,null,null,null,null,null,null,null,null,null,"pts",0,1,"","",0,null,"","","","","","","","","","","","","","","",""]
[{"$f":"'Week 1'!A37","v":"<Enter Participant 27>"},null,null,null,null,null,null,null,null,null,null,null,null,null,null,null,null,null,"pts",0,1,"","",0,null,"","","","","","","","","","","","","","","",""]
[{"$f":"'Week 1'!A38","v":"<Enter Participant 28>"},null,null,null,null,null,null,null,null,null,null,null,null,null,null,null,null,null,"pts",0,1,"","",0,null,"","","","","","","","","","","","","","","",""]
[{"$f":"'Week 1'!A39","v":"<Enter Participant 29>"},null,null,null,null,null,null,null,null,null,null,null,null,null,null,null,null,null,"pts",0,1,"","",0,null,"","","","","","","","","","","","","","","",""]
[{"$f":"'Week 1'!A40","v":"<Enter Participant 30>"},null,null,null,null,null,null,null,null,null,null,null,null,null,null,null,null,null,"pts",0,1,"","",0,null,"","","","","","","","","","","","","","","",""]
[{"$f":"'Week 1'!A41","v":"<Enter Participant 31>"},null,null,null,null,null,null,null,null,null,null,null,null,null,null,null,null,null,"pts",0,1,"","",0,null,"","","","","","","","","","","","","","","",""]
[{"$f":"'Week 1'!A42","v":"<Enter Participant 32>"},null,null,null,null,null,null,null,null,null,null,null,null,null,null,null,null,null,"pts",0,1,"","",0,null,"","","","","","","","","","","","","","","",""]
[{"$f":"'Week 1'!A43","v":"<Enter Participant 33>"},null,null,null,null,null,null,null,null,null,null,null,null,null,null,null,null,null,"pts",{"$f":"IF(SUM(Z43:AO43)=0,0,SUM(Z43:AO43))","v":0},1,"","",{"$f":"VLOOKUP(A43,CUMULATIVE_TABLE,X$1,FALSE)","v":0},null,"","","","","","","","","","","","","","","",""]
[{"$f":"'Week 1'!A44","v":"<Enter Participant 34>"},null,null,null,null,null,null,null,null,null,null,null,null,null,null,null,null,null,"pts",0,1,"","",0,null,{"$f":"IF(ISBLANK(B$6),\"\",IF(B44=B$6,1,0))","v":""},"","","","","","","","","","","","","","",""]
[{"$f":"'Week 1'!A45","v":"<Enter Participant 35>"},null,null,null,null,null,null,null,null,null,null,null,null,null,null,null,null,null,"pts",0,1,"","",0,null,"","","","","","","","","","","","","","","",""]
[{"$f":"'Week 1'!A46","v":"<Enter Participant 36>"},null,null,null,null,null,null,null,null,null,null,null,null,null,null,null,null,null,"pts",0,1,"","",0,null,"","","","","","","","","","","","","","","",""]
[{"$f":"'Week 1'!A47","v":"<Enter Participant 37>"},null,null,null,null,null,null,null,null,null,null,null,null,null,null,null,null,null,"pts",0,1,"","",0,null,"","","","","","","","","","","","","","","",""]
[{"$f":"'Week 1'!A48","v":"<Enter Participant 38>"},null,null,null,null,null,null,null,null,null,null,null,null,null,null,null,null,null,"pts",0,1,"","",0,null,"","","","","","","","","","","","","","","",""]
[{"$f":"'Week 1'!A49","v":"<Enter Participant 39>"},null,null,null,null,null,null,null,null,null,null,null,null,null,null,null,null,null,"pts",0,1,"","",0,null,"","","","","","","","","","","","","","","",""]
[{"$f":"'Week 1'!A50","v":"<Enter Participant 40>"},null,null,null,null,null,null,null,null,null,null,null,null,null,null,null,null,null,"pts",0,1,"","",0,null,"","","","","","","","","","","","","","","",""]
[{"$f":"'Week 1'!A51","v":"<Enter Participant 41>"},null,null,null,null,null,null,null,null,null,null,null,null,null,null,null,null,null,"pts",0,1,"","",0,null,"","","","","","","","","","","","","","","",""]
[{"$f":"'Week 1'!A52","v":"<Enter Participant 42>"},null,null,null,null,null,null,null,null,null,null,null,null,null,null,null,null,null,"pts",0,1,"","",0,null,"","","","","","","","","","","","","","","",""]
[{"$f":"'Week 1'!A53","v":"<Enter Participant 43>"},null,null,null,null,null,null,null,null,null,null,null,null,null,null,null,null,null,"pts",0,1,"","",0,null,"","","","","","","","","","","","","","","",""]
[{"$f":"'Week 1'!A54","v":"<Enter Participant 44>"},null,null,null,null,null,null,null,null,null,null,null,null,null,null,null,null,null,"pts",0,1,"","",0,null,"","","","","","","","","","","","","","","",""]
[{"$f":"'Week 1'!A55","v":"<Enter Participant 45>"},null,null,null,null,null,null,null,null,null,null,null,null,null,null,null,null,null,"pts",0,1,"","",0,null,"","","","","","","","","","","","","","","",""]
[{"$f":"'Week 1'!A56","v":"<Enter Participant 46>"},null,null,null,null,null,null,null,null,null,null,null,null,null,null,null,null,null,"pts",0,1,"","",0,null,"","","","","","","","","","","","","","","",""]
[{"$f":"'Week 1'!A57","v":"<Enter Participant 47>"},null,null,null,null,null,null,null,null,null,null,null,null,null,null,null,null,null,"pts",0,1,"","",0,null,"","","","","","","","","","","","","","","",""]
[{"$f":"'Week 1'!A58","v":"<Enter Participant 48>"},null,null,null,null,null,null,null,null,null,null,null,null,null,null,null,null,null,"pts",0,1,"","",0,null,"","","","","","","","","","","","","","","",""]
[{"$f":"'Week 1'!A59","v":"<Enter Participant 49>"},null,null,null,null,null,null,null,null,null,null,null,null,null,null,null,null,null,"pts",0,1,"","",0,null,"","","","","","","","","","","","","","","",""]
[{"$f":"'Week 1'!A60","v":"<Enter Participant 50>"},null,null,null,null,null,null,null,null,null,null,null,null,null,null,null,null,null,"pts",0,1,"","",0,null,"","","","","","","","","","","","","","","",""]
[{"$f":"'Week 1'!A61","v":"<Enter Participant 51>"},null,null,null,null,null,null,null,null,null,null,null,null,null,null,null,null,null,"pts",0,1,"","",0,null,{"$f":"IF(ISBLANK(B$6),\"\",IF(B61=B$6,1,0))","v":""},"","","","","","","","","","","","","","",""]
[{"$f":"'Week 1'!A62","v":"<Enter Participant 52>"},null,null,null,null,null,null,null,null,null,null,null,null,null,null,null,null,null,"pts",0,1,"","",0,null,"","","","","","","","","","","","","","","",""]
[{"$f":"'Week 1'!A63","v":"<Enter Participant 53>"},null,null,null,null,null,null,null,null,null,null,null,null,null,null,null,null,null,"pts",0,1,"","",0,null,"","","","","","","","","","","","","","","",""]
[{"$f":"'Week 1'!A64","v":"<Enter Participant 54>"},null,null,null,null,null,null,null,null,null,null,null,null,null,null,null,null,null,"pts",0,1,"","",0,null,"","","","","","","","","","","","","","","",""]
[{"$f":"'Week 1'!A65","v":"<Enter Participant 55>"},null,null,null,null,null,null,null,null,null,null,null,null,null,null,null,null,null,"pts",0,1,"","",0,null,"","","","","","","","","","","","","","","",""]
[{"$f":"'Week 1'!A66","v":"<Enter Participant 56>"},null,null,null,null,null,null,null,null,null,null,null,null,null,null,null,null,null,"pts",0,1,"","",0,null,"","","","","","","","","","","","","","","",""]
[{"$f":"'Week 1'!A67","v":"<Enter Participant 57>"},null,null,null,null,null,null,null,null,null,null,null,null,null,null,null,null,null,"pts",0,1,"","",0,null,"","","","","","","","","","","","","","","",""]
[{"$f":"'Week 1'!A68","v":"<Enter Participant 58>"},null,null,null,null,null,null,null,null,null,null,null,null,null,null,null,null,null,"pts",0,1,"","",0,null,"","","","","","","","","","","","","","","",""]
[{"$f":"'Week 1'!A69","v":"<Enter Participant 59>"},null,null,null,null,null,null,null,null,null,null,null,null,null,null,null,null,null,"pts",0,1,"","",0,null,"","","","","","","","","","","","","","","",""]
[{"$f":"'Week 1'!A70","v":"<Enter Participant 60>"},null,null,null,null,null,null,null,null,null,null,null,null,null,null,null,null,null,"pts",0,1,"","",0,null,"","","","","","","","","","","","","","","",""]
[{"$f":"'Week 1'!A71","v":"<Enter Participant 61>"},null,null,null,null,null,null,null,null,null,null,null,null,null,null,null,null,null,"pts",0,1,"","",0,null,"","","","","","","","","","","","","","","",""]
[{"$f":"'Week 1'!A72","v":"<Enter Participant 62>"},null,null,null,null,null,null,null,null,null,null,null,null,null,null,null,null,null,"pts",0,1,"","",0,null,"","","","","","","","","","","","","","","",""]
[{"$f":"'Week 1'!A73","v":"<Enter Participant 63>"},null,null,null,null,null,null,null,null,null,null,null,null,null,null,null,null,null,"pts",0,1,"","",0,null,"","","","","","","","","","","","","","","",""]
[{"$f":"'Week 1'!A74","v":"<Enter Participant 64>"},null,null,null,null,null,null,null,null,null,null,null,null,null,null,null,null,null,"pts",0,1,"","",0,null,"","","","","","","","","","","","","","","",""]
[{"$f":"'Week 1'!A75","v":"<Enter Participant 65>"},null,null,null,null,null,null,null,null,null,null,null,null,null,null,null,null,null,"pts",0,{"$f":"IF(ISERROR(RANK(T75,$T$11:$T$85)),\"\",RANK(T75,$T$11:$T$85))","v":1},{"$f":"IF(ISBLANK(R75),\"\",IF(U75=1,ABS(R75-R$6),\"\"))","v":""},{"$f":"IF(ISERROR(RANK(V75,$V$11:$V$85,1)),\"\",RANK(V75,$V$11:$V$85,1))","v":""},{"$f":"VLOOKUP(A75,CUMULATIVE_TABLE,X$1,FALSE)","v":0},null,"","","","","","","","","","","","","","","",""]
[{"$f":"'Week 1'!A76","v":"<Enter Participant 66>"},null,null,null,null,null,null,null,null,null,null,null,null,null,null,null,null,null,"pts",0,1,"","",0,null,"","","","","","","","","","","","","","","",""]
[{"$f":"'Week 1'!A77","v":"<Enter Participant 67>"},null,null,null,null,null,null,null,null,null,null,null,null,null,null,null,null,null,"pts",0,1,"","",0,null,"","","","","","","","","","","","","","","",""]
[{"$f":"'Week 1'!A78","v":"<Enter Participant 68>"},null,null,null,null,null,null,null,null,null,null,null,null,null,null,null,null,null,"pts",0,1,"","",0,null,{"$f":"IF(ISBLANK(B$6),\"\",IF(B78=B$6,1,0))","v":""},"","","","","","","","","","","","","","",""]
[{"$f":"'Week 1'!A79","v":"<Enter Participant 69>"},null,null,null,null,null,null,null,null,null,null,null,null,null,null,null,null,null,"pts",0,1,"","",0,null,"","","","","","","","","","","","","","","",""]
[{"$f":"'Week 1'!A80","v":"<Enter Participant 70>"},null,null,null,null,null,null,null,null,null,null,null,null,null,null,null,null,null,"pts",0,1,"","",0,null,"","","","","","","","","","","","","","","",""]
[{"$f":"'Week 1'!A81","v":"<Enter Participant 71>"},null,null,null,null,null,null,null,null,null,null,null,null,null,null,null,null,null,"pts",0,1,"","",0,null,"","","","","","","","","","","","","","","",""]
[{"$f":"'Week 1'!A82","v":"<Enter Participant 72>"},null,null,null,null,null,null,null,null,null,null,null,null,null,null,null,null,null,"pts",0,1,"","",0,null,"","","","","","","","","","","","","","","",""]
[{"$f":"'Week 1'!A83","v":"<Enter Participant 73>"},null,null,null,null,null,null,null,null,null,null,null,null,null,null,null,null,null,"pts",0,1,"","",0,null,"","","","","","","","","","","","","","","",""]
[{"$f":"'Week 1'!A84","v":"<Enter Participant 74>"},null,null,null,null,null,null,null,null,null,null,null,null,null,null,null,null,null,"pts",0,1,"","",0,null,"","","","","","","","","","","","","","","",""]
[{"$f":"'Week 1'!A85","v":"<Enter Participant 75>"},null,null,null,null,null,null,null,null,null,null,null,null,null,null,null,null,null,"pts",0,1,"","",0,null,"","","","","","","","","","","","","","","",""]
[{"$f":"'Week 1'!A86","v":"<Enter Participant 76>"},null,null,null,null,null,null,null,null,null,null,null,null,null,null,null,null,null,"pts",0,1,"","",0,null,"","","","","","","","","","","","","","","",""]
[{"$f":"'Week 1'!A87","v":"<Enter Participant 77>"},null,null,null,null,null,null,null,null,null,null,null,null,null,null,null,null,null,"pts",0,1,"","",0,null,"","","","","","","","","","","","","","","",""]
[{"$f":"'Week 1'!A88","v":"<Enter Participant 78>"},null,null,null,null,null,null,null,null,null,null,null,null,null,null,null,null,null,"pts",0,1,"","",0,null,"","","","","","","","","","","","","","","",""]
[{"$f":"'Week 1'!A89","v":"<Enter Participant 79>"},null,null,null,null,null,null,null,null,null,null,null,null,null,null,null,null,null,"pts",0,1,"","",0,null,"","","","","","","","","","","","","","","",""]
[{"$f":"'Week 1'!A90","v":"<Enter Participant 80>"},null,null,null,null,null,null,null,null,null,null,null,null,null,null,null,null,null,"pts",0,1,"","",0,null,"","","","","","","","","","","","","","","",""]
[{"$f":"'Week 1'!A91","v":"<Enter Participant 81>"},null,null,null,null,null,null,null,null,null,null,null,null,null,null,null,null,null,"pts",0,1,"","",0,null,"","","","","","","","","","","","","","","",""]
[{"$f":"'Week 1'!A92","v":"<Enter Participant 82>"},null,null,null,null,null,null,null,null,null,null,null,null,null,null,null,null,null,"pts",0,1,"","",0,null,"","","","","","","","","","","","","","","",""]
[{"$f":"'Week 1'!A93","v":"<Enter Participant 83>"},null,null,null,null,null,null,null,null,null,null,null,null,null,null,null,null,null,"pts",0,1,"","",0,null,"","","","","","","","","","","","","","","",""]
[{"$f":"'Week 1'!A94","v":"<Enter Participant 84>"},null,null,null,null,null,null,null,null,null,null,null,null,null,null,null,null,null,"pts",0,1,"","",0,null,{"$f":"IF(ISBLANK(B$6),\"\",IF(B94=B$6,1,0))","v":""},"","","","","","","","","","","","","","",""]
[{"$f":"'Week 1'!A95","v":"<Enter Participant 85>"},null,null,null,null,null,null,null,null,null,null,null,null,null,null,null,null,null,"pts",0,1,"","",0,null,"","","","","","","","","","","","","","","",""]
[{"$f":"'Week 1'!A96","v":"<Enter Participant 86>"},null,null,null,null,null,null,null,null,null,null,null,null,null,null,null,null,null,"pts",0,1,"","",0,null,"","","","","","","","","","","","","","","",""]
[{"$f":"'Week 1'!A97","v":"<Enter Participant 87>"},null,null,null,null,null,null,null,null,null,null,null,null,null,null,null,null,null,"pts",0,1,"","",0,null,"","","","","","","","","","","","","","","",""]
[{"$f":"'Week 1'!A98","v":"<Enter Participant 88>"},null,null,null,null,null,null,null,null,null,null,null,null,null,null,null,null,null,"pts",0,1,"","",0,null,"","","","","","","","","","","","","","","",""]
[{"$f":"'Week 1'!A99","v":"<Enter Participant 89>"},null,null,null,null,null,null,null,null,null,null,null,null,null,null,null,null,null,"pts",0,1,"","",0,null,"","","","","","","","","","","","","","","",""]
[{"$f":"'Week 1'!A100","v":"<Enter Participant 90>"},null,null,null,null,null,null,null,null,null,null,null,null,null,null,null,null,null,"pts",0,1,"","",0,null,"","","","","","","","","","","","","","","",""]
[{"$f":"'Week 1'!A101","v":"<Enter Participant 91>"},null,null,null,null,null,null,null,null,null,null,null,null,null,null,null,null,null,"pts",0,1,"","",0,null,"","","","","","","","","","","","","","","",""]
[{"$f":"'Week 1'!A102","v":"<Enter Participant 92>"},null,null,null,null,null,null,null,null,null,null,null,null,null,null,null,null,null,"pts",0,1,"","",0,null,"","","","","","","","","","","","","","","",""]
[{"$f":"'Week 1'!A103","v":"<Enter Participant 93>"},null,null,null,null,null,null,null,null,null,null,null,null,null,null,null,null,null,"pts",0,1,"","",0,null,"","","","","","","","","","","","","","","",""]
[{"$f":"'Week 1'!A104","v":"<Enter Participant 94>"},null,null,null,null,null,null,null,null,null,null,null,null,null,null,null,null,null,"pts",0,1,"","",0,null,"","","","","","","","","","","","","","","",""]
[{"$f":"'Week 1'!A105","v":"<Enter Participant 95>"},null,null,null,null,null,null,null,null,null,null,null,null,null,null,null,null,null,"pts",0,1,"","",0,null,"","","","","","","","","","","","","","","",""]
[{"$f":"'Week 1'!A106","v":"<Enter Participant 96>"},null,null,null,null,null,null,null,null,null,null,null,null,null,null,null,null,null,"pts",0,1,"","",0,null,"","","","","","","","","","","","","","","",""]
[{"$f":"'Week 1'!A107","v":"<Enter Participant 97>"},null,null,null,null,null,null,null,null,null,null,null,null,null,null,null,null,null,"pts",{"$f":"IF(SUM(Z107:AO107)=0,0,SUM(Z107:AO107))","v":0},1,"","",0,null,"","","","","","","","","","","","","","","",""]
[{"$f":"'Week 1'!A108","v":"<Enter Participant 98>"},null,null,null,null,null,null,null,null,null,null,null,null,null,null,null,null,null,"pts",0,1,"","",0,null,"","","","","","","","","","","","","","","",""]
[{"$f":"'Week 1'!A109","v":"<Enter Participant 99>"},null,null,null,null,null,null,null,null,null,null,null,null,null,null,null,null,null,"pts",0,1,"","",0,null,"","","","","","","","","","","","","","","",{"$f":"IF(ISBLANK(Q$6),\"\",IF(Q109=Q$6,1,0))","v":""}]
[{"$f":"'Week 1'!A110","v":"<Enter Participant 100>"},null,null,null,null,null,null,null,null,null,null,null,null,null,null,null,null,null,"pts",0,1,"","",0,null,{"$f":"IF(ISBLANK(B$6),\"\",IF(B110=B$6,1,0))","v":""},"","","","","","","","","","","","","","",""]

{"sheet":"Week 17","index":16,"n_rows":110,"n_cols":41,"rows_kept":110,"cut":false,"hidden":false,"merged":[[1,17,1,18],[1,19,3,23],[4,23,9,23],[9,17,9,18]]}
["Week Lookup Column Offset",2,3,4,5,6,7,8,9,10,11,12,13,14,15,16,17,null,null,null,null,null,null,{"$f":"MID(T2,FIND(\" \",T2)+1,2)*1+18","v":35}]
[null,"GAME 1","GAME 2","GAME 3","GAME 4","GAME 5","GAME 6","GAME 7","GAME 8","GAME 9","GAME 10","GAME 11","GAME 12","GAME 13","GAME 14","GAME 15","GAME 16","SCORE",null,"Week 17"]
["VISITOR",{"$f":"IF(VLOOKUP($T$2&\" Visitors\",SCHEDULE_TABLE,B$1,FALSE)=0,\"\",VLOOKUP($T$2&\" Visitors\",SCHEDULE_TABLE,B$1,FALSE))","v":"CAR"},"CLE","DET","JAX","SD","NYJ","CHI","BUF","PHI","CIN","NO","IND","DAL","OAK","ARI","STL",null,"pts"]
[null,"at","at","at","at","at","at","at","at","at","at","at","at","at","at","at","at"]
["HOME",{"$f":"IF(VLOOKUP($T$2&\" Homes\",SCHEDULE_TABLE,B$1,FALSE)=0,\"\",VLOOKUP($T$2&\" Homes\",SCHEDULE_TABLE,B$1,FALSE))","v":"ATL"},"BAL","GB","HOU","KC","MIA","MIN","NE","NYG","PIT","TB","TEN","WAS","DEN","SF","SEA",null,"pts",null,null,null,null,"TOTAL POINTS FOR YEAR"]
["WINNER",null,null,null,null,null,null,null,null,null,null,null,null,null,null,null,null,{"$f":"IF(R3+R5=0,\"\",R3+R5)","v":""},"pts"]
[null,{"$f":"B3","v":"CAR"},"CLE","DET","JAX","SD","NYJ","CHI","BUF","PHI","CIN","NO","IND","DAL","OAK","ARI","STL"]
[null,{"$f":"B5","v":"ATL"},"BAL","GB","HOU","KC","MIA","MIN","NE","NYG","PIT","TB","TEN","WAS","DEN","SF","SEA"]
[]
["NAME","PICKS","PICKS","PICKS","PICKS","PICKS","PICKS","PICKS","PICKS","PICKS","PICKS","PICKS","PICKS","PICKS","PICKS","PICKS","PICKS","TIE-BREAK",null,"PICK PTS","PTS RANK","ABS DIFF","TIE-BREAK"]
[{"$f":"'Week 1'!A11","v":"<Enter Participant 1>"},null,null,null,null,null,null,null,null,null,null,null,null,null,null,null,null,null,"pts",{"$f":"IF(SUM(Z11:AO11)=0,0,SUM(Z11:AO11))","v":0},{"$f":"IF(ISERROR(RANK(T11,$T$11:$T$85)),\"\",RANK(T11,$T$11:$T$85))","v":1},{"$f":"IF(ISBLANK(R11),\"\",IF(U11=1,ABS(R11-R$6),\"\"))","v":""},{"$f":"IF(ISERROR(RANK(V11,$V$11:$V$85,1)),\"\",RANK(V11,$V$11:$V$85,1))","v":""},{"$f":"VLOOKUP(A11,CUMULATIVE_TABLE,X$1,FALSE)","v":0},null,{"$f":"IF(ISBLANK(B$6),\"\",IF(B11=B$6,1,0))","v":""},"","","","","","","","","","","","","","",""]
[{"$f":"'Week 1'!A12","v":"<Enter Participant 2>"},null,null,null,null,null,null,null,null,null,null,null,null,null,null,null,null,null,"pts",0,1,"","",0,null,"","","","","","","","","","","","","","","",""]
[{"$f":"'Week 1'!A13","v":"<Enter Participant 3>"},null,null,null,null,null,null,null,null,null,null,null,null,null,null,null,null,null,"pts",0,1,"","",0,null,"","","","","","","","","","","","","","","",""]
[{"$f":"'Week 1'!A14","v":"<Enter Participant 4>"},null,null,null,null,null,null,null,null,null,null,null,null,null,null,null,null,null,"pts",0,1,"","",0,null,"","","","","","","","","","","","","","","",""]
[{"$f":"'Week 1'!A15","v":"<Enter Participant 5>"},null,null,null,null,null,null,null,null,null,null,null,null,null,null,null,null,null,"pts",0,1,"","",0,null,"","","","","","","","","","","","","","","",""]
[{"$f":"'Week 1'!A16","v":"<Enter Participant 6>"},null,null,null,null,null,null,null,null,null,null,null,null,null,null,null,null,null,"pts",0,1,"","",0,null,"","","","","","","","","","","","","","","",""]
[{"$f":"'Week 1'!A17","v":"<Enter Participant 7>"},null,null,null,null,null,null,null,null,null,null,null,null,null,null,null,null,null,"pts",0,1,"","",0,null,"","","","","","","","","","","","","","","",""]
[{"$f":"'Week 1'!A18","v":"<Enter Participant 8>"},null,null,null,null,null,null,null,null,null,null,null,null,null,null,null,null,null,"pts",0,1,"","",0,null,"","","","","","","","","","","","","","","",""]
[{"$f":"'Week 1'!A19","v":"<Enter Participant 9>"},null,null,null,null,null,null,null,null,null,null,null,null,null,null,null,null,null,"pts",0,1,"","",0,null,"","","","","","","","","","","","","","","",""]
[{"$f":"'Week 1'!A20","v":"<Enter Participant 10>"},null,null,null,null,null,null,null,null,null,null,null,null,null,null,null,null,null,"pts",0,1,"","",0,null,"","","","","","","","","","","","","","","",""]
[{"$f":"'Week 1'!A21","v":"<Enter Participant 11>"},null,null,null,null,null,null,null,null,null,null,null,null,null,null,null,null,null,"pts",0,1,"","",0,null,"","","","","","","","","","","","","","","",""]
[{"$f":"'Week 1'!A22","v":"<Enter Participant 12>"},null,null,null,null,null,null,null,null,null,null,null,null,null,null,null,null,null,"pts",0,1,"","",0,null,"","","","","","","","","","","","","","","",""]
[{"$f":"'Week 1'!A23","v":"<Enter Participant 13>"},null,null,null,null,null,null,null,null,null,null,null,null,null,null,null,null,null,"pts",0,1,"","",0,null,"","","","","","","","","","","","","","","",""]
[{"$f":"'Week 1'!A24","v":"<Enter Participant 14>"},null,null,null,null,null,null,null,null,null,null,null,null,null,null,null,null,null,"pts",0,1,"","",0,null,"","","","","","","","","","","","","","","",""]
[{"$f":"'Week 1'!A25","v":"<Enter Participant 15>"},null,null,null,null,null,null,null,null,null,null,null,null,null,null,null,null,null,"pts",0,1,"","",0,null,"","","","","","","","","","","","","","","",""]
[{"$f":"'Week 1'!A26","v":"<Enter Participant 16>"},null,null,null,null,null,null,null,null,null,null,null,null,null,null,null,null,null,"pts",0,1,"","",0,null,"","","","","","","","","","","","","","","",{"$f":"IF(ISBLANK(Q$6),\"\",IF(Q26=Q$6,1,0))","v":""}]
[{"$f":"'Week 1'!A27","v":"<Enter Participant 17>"},null,null,null,null,null,null,null,null,null,null,null,null,null,null,null,null,null,"pts",0,1,"","",0,null,{"$f":"IF(ISBLANK(B$6),\"\",IF(B27=B$6,1,0))","v":""},"","","","","","","","","","","","","","",""]
[{"$f":"'Week 1'!A28","v":"<Enter Participant 18>"},null,null,null,null,null,null,null,null,null,null,null,null,null,null,null,null,null,"pts",0,1,"","",0,null,"","","","","","","","","","","","","","","",""]
[{"$f":"'Week 1'!A29","v":"<Enter Participant 19>"},null,null,null,null,null,null,null,null,null,null,null,null,null,null,null,null,null,"pts",0,1,"","",0,null,"","","","","","","","","","","","","","","",""]
[{"$f":"'Week 1'!A30","v":"<Enter Participant 20>"},null,null,null,null,null,null,null,null,null,null,null,null,null,null,null,null,null,"pts",0,1,"","",0,null,"","","","","","","","","","","","","","","",""]
[{"$f":"'Week 1'!A31","v":"<Enter Participant 21>"},null,null,null,null,null,null,null,null,null,null,null,null,null,null,null,null,null,"pts",0,1,"","",0,null,"","","","","","","","","","","","","","","",""]
[{"$f":"'Week 1'!A32","v":"<Enter Participant 22>"},null,null,null,null,null,null,null,null,null,null,null,null,null,null,null,null,null,"pts",0,1,"","",0,null,"","","","","","","","","","","","","","","",""]
[{"$f":"'Week 1'!A33","v":"<Enter Participant 23>"},null,null,null,null,null,null,null,null,null,null,null,null,null,null,null,null,null,"pts",0,1,"","",0,null,"","","","","","","","","","","","","","","",""]
[{"$f":"'Week 1'!A34","v":"<Enter Participant 24>"},null,null,null,null,null,null,null,null,null,null,null,null,null,null,null,null,null,"pts",0,1,"","",0,null,"","","","","","","","","","","","","","","",""]
[{"$f":"'Week 1'!A35","v":"<Enter Participant 25>"},null,null,null,null,null,null,null,null,null,null,null,null,null,null,null,null,null,"pts",0,1,"","",0,null,"","","","","","","","","","","","","","","",""]
[{"$f":"'Week 1'!A36","v":"<Enter Participant 26>"},null,null,null,null,null,null,null,null,null,null,null,null,null,null,null,null,null,"pts",0,1,"","",0,null,"","","","","","","","","","","","","","","",""]
[{"$f":"'Week 1'!A37","v":"<Enter Participant 27>"},null,null,null,null,null,null,null,null,null,null,null,null,null,null,null,null,null,"pts",0,1,"","",0,null,"","","","","","","","","","","","","","","",""]
[{"$f":"'Week 1'!A38","v":"<Enter Participant 28>"},null,null,null,null,null,null,null,null,null,null,null,null,null,null,null,null,null,"pts",0,1,"","",0,null,"","","","","","","","","","","","","","","",""]
[{"$f":"'Week 1'!A39","v":"<Enter Participant 29>"},null,null,null,null,null,null,null,null,null,null,null,null,null,null,null,null,null,"pts",0,1,"","",0,null,"","","","","","","","","","","","","","","",""]
[{"$f":"'Week 1'!A40","v":"<Enter Participant 30>"},null,null,null,null,null,null,null,null,null,null,null,null,null,null,null,null,null,"pts",0,1,"","",0,null,"","","","","","","","","","","","","","","",""]
[{"$f":"'Week 1'!A41","v":"<Enter Participant 31>"},null,null,null,null,null,null,null,null,null,null,null,null,null,null,null,null,null,"pts",0,1,"","",0,null,"","","","","","","","","","","","","","","",""]
[{"$f":"'Week 1'!A42","v":"<Enter Participant 32>"},null,null,null,null,null,null,null,null,null,null,null,null,null,null,null,null,null,"pts",0,1,"","",0,null,"","","","","","","","","","","","","","","",""]
[{"$f":"'Week 1'!A43","v":"<Enter Participant 33>"},null,null,null,null,null,null,null,null,null,null,null,null,null,null,null,null,null,"pts",{"$f":"IF(SUM(Z43:AO43)=0,0,SUM(Z43:AO43))","v":0},1,"","",{"$f":"VLOOKUP(A43,CUMULATIVE_TABLE,X$1,FALSE)","v":0},null,"","","","","","","","","","","","","","","",""]
[{"$f":"'Week 1'!A44","v":"<Enter Participant 34>"},null,null,null,null,null,null,null,null,null,null,null,null,null,null,null,null,null,"pts",0,1,"","",0,null,{"$f":"IF(ISBLANK(B$6),\"\",IF(B44=B$6,1,0))","v":""},"","","","","","","","","","","","","","",""]
[{"$f":"'Week 1'!A45","v":"<Enter Participant 35>"},null,null,null,null,null,null,null,null,null,null,null,null,null,null,null,null,null,"pts",0,1,"","",0,null,"","","","","","","","","","","","","","","",""]
[{"$f":"'Week 1'!A46","v":"<Enter Participant 36>"},null,null,null,null,null,null,null,null,null,null,null,null,null,null,null,null,null,"pts",0,1,"","",0,null,"","","","","","","","","","","","","","","",""]
[{"$f":"'Week 1'!A47","v":"<Enter Participant 37>"},null,null,null,null,null,null,null,null,null,null,null,null,null,null,null,null,null,"pts",0,1,"","",0,null,"","","","","","","","","","","","","","","",""]
[{"$f":"'Week 1'!A48","v":"<Enter Participant 38>"},null,null,null,null,null,null,null,null,null,null,null,null,null,null,null,null,null,"pts",0,1,"","",0,null,"","","","","","","","","","","","","","","",""]
[{"$f":"'Week 1'!A49","v":"<Enter Participant 39>"},null,null,null,null,null,null,null,null,null,null,null,null,null,null,null,null,null,"pts",0,1,"","",0,null,"","","","","","","","","","","","","","","",""]
[{"$f":"'Week 1'!A50","v":"<Enter Participant 40>"},null,null,null,null,null,null,null,null,null,null,null,null,null,null,null,null,null,"pts",0,1,"","",0,null,"","","","","","","","","","","","","","","",""]
[{"$f":"'Week 1'!A51","v":"<Enter Participant 41>"},null,null,null,null,null,null,null,null,null,null,null,null,null,null,null,null,null,"pts",0,1,"","",0,null,"","","","","","","","","","","","","","","",""]
[{"$f":"'Week 1'!A52","v":"<Enter Participant 42>"},null,null,null,null,null,null,null,null,null,null,null,null,null,null,null,null,null,"pts",0,1,"","",0,null,"","","","","","","","","","","","","","","",""]
[{"$f":"'Week 1'!A53","v":"<Enter Participant 43>"},null,null,null,null,null,null,null,null,null,null,null,null,null,null,null,null,null,"pts",0,1,"","",0,null,"","","","","","","","","","","","","","","",""]
[{"$f":"'Week 1'!A54","v":"<Enter Participant 44>"},null,null,null,null,null,null,null,null,null,null,null,null,null,null,null,null,null,"pts",0,1,"","",0,null,"","","","","","","","","","","","","","","",""]
[{"$f":"'Week 1'!A55","v":"<Enter Participant 45>"},null,null,null,null,null,null,null,null,null,null,null,null,null,null,null,null,null,"pts",0,1,"","",0,null,"","","","","","","","","","","","","","","",""]
[{"$f":"'Week 1'!A56","v":"<Enter Participant 46>"},null,null,null,null,null,null,null,null,null,null,null,null,null,null,null,null,null,"pts",0,1,"","",0,null,"","","","","","","","","","","","","","","",""]
[{"$f":"'Week 1'!A57","v":"<Enter Participant 47>"},null,null,null,null,null,null,null,null,null,null,null,null,null,null,null,null,null,"pts",0,1,"","",0,null,"","","","","","","","","","","","","","","",""]
[{"$f":"'Week 1'!A58","v":"<Enter Participant 48>"},null,null,null,null,null,null,null,null,null,null,null,null,null,null,null,null,null,"pts",0,1,"","",0,null,"","","","","","","","","","","","","","","",""]
[{"$f":"'Week 1'!A59","v":"<Enter Participant 49>"},null,null,null,null,null,null,null,null,null,null,null,null,null,null,null,null,null,"pts",0,1,"","",0,null,"","","","","","","","","","","","","","","",""]
[{"$f":"'Week 1'!A60","v":"<Enter Participant 50>"},null,null,null,null,null,null,null,null,null,null,null,null,null,null,null,null,null,"pts",0,1,"","",0,null,"","","","","","","","","","","","","","","",""]
[{"$f":"'Week 1'!A61","v":"<Enter Participant 51>"},null,null,null,null,null,null,null,null,null,null,null,null,null,null,null,null,null,"pts",0,1,"","",0,null,{"$f":"IF(ISBLANK(B$6),\"\",IF(B61=B$6,1,0))","v":""},"","","","","","","","","","","","","","",""]
[{"$f":"'Week 1'!A62","v":"<Enter Participant 52>"},null,null,null,null,null,null,null,null,null,null,null,null,null,null,null,null,null,"pts",0,1,"","",0,null,"","","","","","","","","","","","","","","",""]
[{"$f":"'Week 1'!A63","v":"<Enter Participant 53>"},null,null,null,null,null,null,null,null,null,null,null,null,null,null,null,null,null,"pts",0,1,"","",0,null,"","","","","","","","","","","","","","","",""]
[{"$f":"'Week 1'!A64","v":"<Enter Participant 54>"},null,null,null,null,null,null,null,null,null,null,null,null,null,null,null,null,null,"pts",0,1,"","",0,null,"","","","","","","","","","","","","","","",""]
[{"$f":"'Week 1'!A65","v":"<Enter Participant 55>"},null,null,null,null,null,null,null,null,null,null,null,null,null,null,null,null,null,"pts",0,1,"","",0,null,"","","","","","","","","","","","","","","",""]
[{"$f":"'Week 1'!A66","v":"<Enter Participant 56>"},null,null,null,null,null,null,null,null,null,null,null,null,null,null,null,null,null,"pts",0,1,"","",0,null,"","","","","","","","","","","","","","","",""]
[{"$f":"'Week 1'!A67","v":"<Enter Participant 57>"},null,null,null,null,null,null,null,null,null,null,null,null,null,null,null,null,null,"pts",0,1,"","",0,null,"","","","","","","","","","","","","","","",""]
[{"$f":"'Week 1'!A68","v":"<Enter Participant 58>"},null,null,null,null,null,null,null,null,null,null,null,null,null,null,null,null,null,"pts",0,1,"","",0,null,"","","","","","","","","","","","","","","",""]
[{"$f":"'Week 1'!A69","v":"<Enter Participant 59>"},null,null,null,null,null,null,null,null,null,null,null,null,null,null,null,null,null,"pts",0,1,"","",0,null,"","","","","","","","","","","","","","","",""]
[{"$f":"'Week 1'!A70","v":"<Enter Participant 60>"},null,null,null,null,null,null,null,null,null,null,null,null,null,null,null,null,null,"pts",0,1,"","",0,null,"","","","","","","","","","","","","","","",""]
[{"$f":"'Week 1'!A71","v":"<Enter Participant 61>"},null,null,null,null,null,null,null,null,null,null,null,null,null,null,null,null,null,"pts",0,1,"","",0,null,"","","","","","","","","","","","","","","",""]
[{"$f":"'Week 1'!A72","v":"<Enter Participant 62>"},null,null,null,null,null,null,null,null,null,null,null,null,null,null,null,null,null,"pts",0,1,"","",0,null,"","","","","","","","","","","","","","","",""]
[{"$f":"'Week 1'!A73","v":"<Enter Participant 63>"},null,null,null,null,null,null,null,null,null,null,null,null,null,null,null,null,null,"pts",0,1,"","",0,null,"","","","","","","","","","","","","","","",""]
[{"$f":"'Week 1'!A74","v":"<Enter Participant 64>"},null,null,null,null,null,null,null,null,null,null,null,null,null,null,null,null,null,"pts",0,1,"","",0,null,"","","","","","","","","","","","","","","",""]
[{"$f":"'Week 1'!A75","v":"<Enter Participant 65>"},null,null,null,null,null,null,null,null,null,null,null,null,null,null,null,null,null,"pts",0,{"$f":"IF(ISERROR(RANK(T75,$T$11:$T$85)),\"\",RANK(T75,$T$11:$T$85))","v":1},{"$f":"IF(ISBLANK(R75),\"\",IF(U75=1,ABS(R75-R$6),\"\"))","v":""},{"$f":"IF(ISERROR(RANK(V75,$V$11:$V$85,1)),\"\",RANK(V75,$V$11:$V$85,1))","v":""},{"$f":"VLOOKUP(A75,CUMULATIVE_TABLE,X$1,FALSE)","v":0},null,"","","","","","","","","","","","","","","",""]
[{"$f":"'Week 1'!A76","v":"<Enter Participant 66>"},null,null,null,null,null,null,null,null,null,null,null,null,null,null,null,null,null,"pts",0,1,"","",0,null,"","","","","","","","","","","","","","","",""]
[{"$f":"'Week 1'!A77","v":"<Enter Participant 67>"},null,null,null,null,null,null,null,null,null,null,null,null,null,null,null,null,null,"pts",0,1,"","",0,null,"","","","","","","","","","","","","","","",""]
[{"$f":"'Week 1'!A78","v":"<Enter Participant 68>"},null,null,null,null,null,null,null,null,null,null,null,null,null,null,null,null,null,"pts",0,1,"","",0,null,{"$f":"IF(ISBLANK(B$6),\"\",IF(B78=B$6,1,0))","v":""},"","","","","","","","","","","","","","",""]
[{"$f":"'Week 1'!A79","v":"<Enter Participant 69>"},null,null,null,null,null,null,null,null,null,null,null,null,null,null,null,null,null,"pts",0,1,"","",0,null,"","","","","","","","","","","","","","","",""]
[{"$f":"'Week 1'!A80","v":"<Enter Participant 70>"},null,null,null,null,null,null,null,null,null,null,null,null,null,null,null,null,null,"pts",0,1,"","",0,null,"","","","","","","","","","","","","","","",""]
[{"$f":"'Week 1'!A81","v":"<Enter Participant 71>"},null,null,null,null,null,null,null,null,null,null,null,null,null,null,null,null,null,"pts",0,1,"","",0,null,"","","","","","","","","","","","","","","",""]
[{"$f":"'Week 1'!A82","v":"<Enter Participant 72>"},null,null,null,null,null,null,null,null,null,null,null,null,null,null,null,null,null,"pts",0,1,"","",0,null,"","","","","","","","","","","","","","","",""]
[{"$f":"'Week 1'!A83","v":"<Enter Participant 73>"},null,null,null,null,null,null,null,null,null,null,null,null,null,null,null,null,null,"pts",0,1,"","",0,null,"","","","","","","","","","","","","","","",""]
[{"$f":"'Week 1'!A84","v":"<Enter Participant 74>"},null,null,null,null,null,null,null,null,null,null,null,null,null,null,null,null,null,"pts",0,1,"","",0,null,"","","","","","","","","","","","","","","",""]
[{"$f":"'Week 1'!A85","v":"<Enter Participant 75>"},null,null,null,null,null,null,null,null,null,null,null,null,null,null,null,null,null,"pts",0,1,"","",0,null,"","","","","","","","","","","","","","","",""]
[{"$f":"'Week 1'!A86","v":"<Enter Participant 76>"},null,null,null,null,null,null,null,null,null,null,null,null,null,null,null,null,null,"pts",0,1,"","",0,null,"","","","","","","","","","","","","","","",""]
[{"$f":"'Week 1'!A87","v":"<Enter Participant 77>"},null,null,null,null,null,null,null,null,null,null,null,null,null,null,null,null,null,"pts",0,1,"","",0,null,"","","","","","","","","","","","","","","",""]
[{"$f":"'Week 1'!A88","v":"<Enter Participant 78>"},null,null,null,null,null,null,null,null,null,null,null,null,null,null,null,null,null,"pts",0,1,"","",0,null,"","","","","","","","","","","","","","","",""]
[{"$f":"'Week 1'!A89","v":"<Enter Participant 79>"},null,null,null,null,null,null,null,null,null,null,null,null,null,null,null,null,null,"pts",0,1,"","",0,null,"","","","","","","","","","","","","","","",""]
[{"$f":"'Week 1'!A90","v":"<Enter Participant 80>"},null,null,null,null,null,null,null,null,null,null,null,null,null,null,null,null,null,"pts",0,1,"","",0,null,"","","","","","","","","","","","","","","",""]
[{"$f":"'Week 1'!A91","v":"<Enter Participant 81>"},null,null,null,null,null,null,null,null,null,null,null,null,null,null,null,null,null,"pts",0,1,"","",0,null,"","","","","","","","","","","","","","","",""]
[{"$f":"'Week 1'!A92","v":"<Enter Participant 82>"},null,null,null,null,null,null,null,null,null,null,null,null,null,null,null,null,null,"pts",0,1,"","",0,null,"","","","","","","","","","","","","","","",""]
[{"$f":"'Week 1'!A93","v":"<Enter Participant 83>"},null,null,null,null,null,null,null,null,null,null,null,null,null,null,null,null,null,"pts",0,1,"","",0,null,"","","","","","","","","","","","","","","",""]
[{"$f":"'Week 1'!A94","v":"<Enter Participant 84>"},null,null,null,null,null,null,null,null,null,null,null,null,null,null,null,null,null,"pts",0,1,"","",0,null,{"$f":"IF(ISBLANK(B$6),\"\",IF(B94=B$6,1,0))","v":""},"","","","","","","","","","","","","","",""]
[{"$f":"'Week 1'!A95","v":"<Enter Participant 85>"},null,null,null,null,null,null,null,null,null,null,null,null,null,null,null,null,null,"pts",0,1,"","",0,null,"","","","","","","","","","","","","","","",""]
[{"$f":"'Week 1'!A96","v":"<Enter Participant 86>"},null,null,null,null,null,null,null,null,null,null,null,null,null,null,null,null,null,"pts",0,1,"","",0,null,"","","","","","","","","","","","","","","",""]
[{"$f":"'Week 1'!A97","v":"<Enter Participant 87>"},null,null,null,null,null,null,null,null,null,null,null,null,null,null,null,null,null,"pts",0,1,"","",0,null,"","","","","","","","","","","","","","","",""]
[{"$f":"'Week 1'!A98","v":"<Enter Participant 88>"},null,null,null,null,null,null,null,null,null,null,null,null,null,null,null,null,null,"pts",0,1,"","",0,null,"","","","","","","","","","","","","","","",""]
[{"$f":"'Week 1'!A99","v":"<Enter Participant 89>"},null,null,null,null,null,null,null,null,null,null,null,null,null,null,null,null,null,"pts",0,1,"","",0,null,"","","","","","","","","","","","","","","",""]
[{"$f":"'Week 1'!A100","v":"<Enter Participant 90>"},null,null,null,null,null,null,null,null,null,null,null,null,null,null,null,null,null,"pts",0,1,"","",0,null,"","","","","","","","","","","","","","","",""]
[{"$f":"'Week 1'!A101","v":"<Enter Participant 91>"},null,null,null,null,null,null,null,null,null,null,null,null,null,null,null,null,null,"pts",0,1,"","",0,null,"","","","","","","","","","","","","","","",""]
[{"$f":"'Week 1'!A102","v":"<Enter Participant 92>"},null,null,null,null,null,null,null,null,null,null,null,null,null,null,null,null,null,"pts",0,1,"","",0,null,"","","","","","","","","","","","","","","",""]
[{"$f":"'Week 1'!A103","v":"<Enter Participant 93>"},null,null,null,null,null,null,null,null,null,null,null,null,null,null,null,null,null,"pts",0,1,"","",0,null,"","","","","","","","","","","","","","","",""]
[{"$f":"'Week 1'!A104","v":"<Enter Participant 94>"},null,null,null,null,null,null,null,null,null,null,null,null,null,null,null,null,null,"pts",0,1,"","",0,null,"","","","","","","","","","","","","","","",""]
[{"$f":"'Week 1'!A105","v":"<Enter Participant 95>"},null,null,null,null,null,null,null,null,null,null,null,null,null,null,null,null,null,"pts",0,1,"","",0,null,"","","","","","","","","","","","","","","",""]
[{"$f":"'Week 1'!A106","v":"<Enter Participant 96>"},null,null,null,null,null,null,null,null,null,null,null,null,null,null,null,null,null,"pts",0,1,"","",0,null,"","","","","","","","","","","","","","","",""]
[{"$f":"'Week 1'!A107","v":"<Enter Participant 97>"},null,null,null,null,null,null,null,null,null,null,null,null,null,null,null,null,null,"pts",{"$f":"IF(SUM(Z107:AO107)=0,0,SUM(Z107:AO107))","v":0},1,"","",0,null,"","","","","","","","","","","","","","","",""]
[{"$f":"'Week 1'!A108","v":"<Enter Participant 98>"},null,null,null,null,null,null,null,null,null,null,null,null,null,null,null,null,null,"pts",0,1,"","",0,null,"","","","","","","","","","","","","","","",""]
[{"$f":"'Week 1'!A109","v":"<Enter Participant 99>"},null,null,null,null,null,null,null,null,null,null,null,null,null,null,null,null,null,"pts",0,1,"","",0,null,"","","","","","","","","","","","","","","",{"$f":"IF(ISBLANK(Q$6),\"\",IF(Q109=Q$6,1,0))","v":""}]
[{"$f":"'Week 1'!A110","v":"<Enter Participant 100>"},null,null,null,null,null,null,null,null,null,null,null,null,null,null,null,null,null,"pts",0,1,"","",0,null,{"$f":"IF(ISBLANK(B$6),\"\",IF(B110=B$6,1,0))","v":""},"","","","","","","","","","","","","","",""]

{"sheet":"cumulative_points","index":17,"n_rows":103,"n_cols":36,"rows_kept":103,"cut":false,"hidden":true,"merged":[[1,2,1,18],[1,19,1,35]]}
[]
[null,null,"Weekly Totals",null,null,null,null,null,null,null,null,null,null,null,null,null,null,null,null,"Cumulative Totals as of Each Week"]
[null,"PARTICIPANT","Week 1","Week 2","Week 3","Week 4","Week 5","Week 6","Week 7","Week 8","Week 9","Week 10","Week 11","Week 12","Week 13","Week 14","Week 15","Week 16","Week 17",{"$f":"C3","v":"Week 1"},{"$f":"D3","v":"Week 2"},"Week 3","Week 4","Week 5","Week 6","Week 7","Week 8","Week 9","Week 10","Week 11","Week 12","Week 13","Week 14","Week 15","Week 16","Week 17"]
[null,{"$f":"'Week 1'!A11","v":"<Enter Participant 1>"},{"$f":"IF(VLOOKUP($B4,INDIRECT(\"'\"&C$3&\"'!$A$10:$T$110\"),20,FALSE)=\"\",0,VLOOKUP($B4,INDIRECT(\"'\"&C$3&\"'!$A$10:$T$110\"),20,FALSE))","v":0},{"$f":"IF(VLOOKUP($B4,INDIRECT(\"'\"&D$3&\"'!$A$10:$T$110\"),20,FALSE)=\"\",0,VLOOKUP($B4,INDIRECT(\"'\"&D$3&\"'!$A$10:$T$110\"),20,FALSE))","v":0},0,0,0,0,0,0,0,0,0,0,0,0,0,0,0,{"$f":"SUM($C4:C4)","v":0},{"$f":"SUM($C4:D4)","v":0},{"$f":"SUM($C4:E4)","v":0},{"$f":"SUM($C4:F4)","v":0},{"$f":"SUM($C4:G4)","v":0},{"$f":"SUM($C4:H4)","v":0},{"$f":"SUM($C4:I4)","v":0},{"$f":"SUM($C4:J4)","v":0},{"$f":"SUM($C4:K4)","v":0},{"$f":"SUM($C4:L4)","v":0},{"$f":"SUM($C4:M4)","v":0},{"$f":"SUM($C4:N4)","v":0},{"$f":"SUM($C4:O4)","v":0},{"$f":"SUM($C4:P4)","v":0},{"$f":"SUM($C4:Q4)","v":0},{"$f":"SUM($C4:R4)","v":0},{"$f":"SUM($C4:S4)","v":0}]
[null,{"$f":"'Week 1'!A12","v":"<Enter Participant 2>"},{"$f":"IF(VLOOKUP($B5,INDIRECT(\"'\"&C$3&\"'!$A$10:$T$110\"),20,FALSE)=\"\",0,VLOOKUP($B5,INDIRECT(\"'\"&C$3&\"'!$A$10:$T$110\"),20,FALSE))","v":0},0,0,0,0,0,0,0,0,0,0,0,0,0,0,0,0,{"$f":"SUM($C5:C5)","v":0},{"$f":"SUM($C5:D5)","v":0},{"$f":"SUM($C5:E5)","v":0},{"$f":"SUM($C5:F5)","v":0},{"$f":"SUM($C5:G5)","v":0},{"$f":"SUM($C5:H5)","v":0},{"$f":"SUM($C5:I5)","v":0},{"$f":"SUM($C5:J5)","v":0},{"$f":"SUM($C5:K5)","v":0},{"$f":"SUM($C5:L5)","v":0},{"$f":"SUM($C5:M5)","v":0},{"$f":"SUM($C5:N5)","v":0},{"$f":"SUM($C5:O5)","v":0},{"$f":"SUM($C5:P5)","v":0},{"$f":"SUM($C5:Q5)","v":0},{"$f":"SUM($C5:R5)","v":0},{"$f":"SUM($C5:S5)","v":0}]
[null,{"$f":"'Week 1'!A13","v":"<Enter Participant 3>"},0,0,0,0,0,0,0,0,0,0,0,0,0,0,0,0,0,{"$f":"SUM($C6:C6)","v":0},{"$f":"SUM($C6:D6)","v":0},{"$f":"SUM($C6:E6)","v":0},{"$f":"SUM($C6:F6)","v":0},{"$f":"SUM($C6:G6)","v":0},{"$f":"SUM($C6:H6)","v":0},{"$f":"SUM($C6:I6)","v":0},{"$f":"SUM($C6:J6)","v":0},{"$f":"SUM($C6:K6)","v":0},{"$f":"SUM($C6:L6)","v":0},{"$f":"SUM($C6:M6)","v":0},{"$f":"SUM($C6:N6)","v":0},{"$f":"SUM($C6:O6)","v":0},{"$f":"SUM($C6:P6)","v":0},{"$f":"SUM($C6:Q6)","v":0},{"$f":"SUM($C6:R6)","v":0},{"$f":"SUM($C6:S6)","v":0}]
[null,{"$f":"'Week 1'!A14","v":"<Enter Participant 4>"},0,0,0,0,0,0,0,0,0,0,0,0,0,0,0,0,0,{"$f":"SUM($C7:C7)","v":0},{"$f":"SUM($C7:D7)","v":0},{"$f":"SUM($C7:E7)","v":0},{"$f":"SUM($C7:F7)","v":0},{"$f":"SUM($C7:G7)","v":0},{"$f":"SUM($C7:H7)","v":0},{"$f":"SUM($C7:I7)","v":0},{"$f":"SUM($C7:J7)","v":0},{"$f":"SUM($C7:K7)","v":0},{"$f":"SUM($C7:L7)","v":0},{"$f":"SUM($C7:M7)","v":0},{"$f":"SUM($C7:N7)","v":0},{"$f":"SUM($C7:O7)","v":0},{"$f":"SUM($C7:P7)","v":0},{"$f":"SUM($C7:Q7)","v":0},{"$f":"SUM($C7:R7)","v":0},{"$f":"SUM($C7:S7)","v":0}]
[null,{"$f":"'Week 1'!A15","v":"<Enter Participant 5>"},0,0,0,0,0,0,0,0,0,0,0,0,0,0,0,0,0,{"$f":"SUM($C8:C8)","v":0},{"$f":"SUM($C8:D8)","v":0},{"$f":"SUM($C8:E8)","v":0},{"$f":"SUM($C8:F8)","v":0},{"$f":"SUM($C8:G8)","v":0},{"$f":"SUM($C8:H8)","v":0},{"$f":"SUM($C8:I8)","v":0},{"$f":"SUM($C8:J8)","v":0},{"$f":"SUM($C8:K8)","v":0},{"$f":"SUM($C8:L8)","v":0},{"$f":"SUM($C8:M8)","v":0},{"$f":"SUM($C8:N8)","v":0},{"$f":"SUM($C8:O8)","v":0},{"$f":"SUM($C8:P8)","v":0},{"$f":"SUM($C8:Q8)","v":0},{"$f":"SUM($C8:R8)","v":0},{"$f":"SUM($C8:S8)","v":0}]
[null,{"$f":"'Week 1'!A16","v":"<Enter Participant 6>"},0,0,0,0,0,0,0,0,0,0,0,0,0,0,0,0,0,{"$f":"SUM($C9:C9)","v":0},{"$f":"SUM($C9:D9)","v":0},{"$f":"SUM($C9:E9)","v":0},{"$f":"SUM($C9:F9)","v":0},{"$f":"SUM($C9:G9)","v":0},{"$f":"SUM($C9:H9)","v":0},{"$f":"SUM($C9:I9)","v":0},{"$f":"SUM($C9:J9)","v":0},{"$f":"SUM($C9:K9)","v":0},{"$f":"SUM($C9:L9)","v":0},{"$f":"SUM($C9:M9)","v":0},{"$f":"SUM($C9:N9)","v":0},{"$f":"SUM($C9:O9)","v":0},{"$f":"SUM($C9:P9)","v":0},{"$f":"SUM($C9:Q9)","v":0},{"$f":"SUM($C9:R9)","v":0},{"$f":"SUM($C9:S9)","v":0}]
[null,{"$f":"'Week 1'!A17","v":"<Enter Participant 7>"},0,0,0,0,0,0,0,0,0,0,0,0,0,0,0,0,0,{"$f":"SUM($C10:C10)","v":0},{"$f":"SUM($C10:D10)","v":0},{"$f":"SUM($C10:E10)","v":0},{"$f":"SUM($C10:F10)","v":0},{"$f":"SUM($C10:G10)","v":0},{"$f":"SUM($C10:H10)","v":0},{"$f":"SUM($C10:I10)","v":0},{"$f":"SUM($C10:J10)","v":0},{"$f":"SUM($C10:K10)","v":0},{"$f":"SUM($C10:L10)","v":0},{"$f":"SUM($C10:M10)","v":0},{"$f":"SUM($C10:N10)","v":0},{"$f":"SUM($C10:O10)","v":0},{"$f":"SUM($C10:P10)","v":0},{"$f":"SUM($C10:Q10)","v":0},{"$f":"SUM($C10:R10)","v":0},{"$f":"SUM($C10:S10)","v":0}]
[null,{"$f":"'Week 1'!A18","v":"<Enter Participant 8>"},0,0,0,0,0,0,0,0,0,0,0,0,0,0,0,0,0,{"$f":"SUM($C11:C11)","v":0},{"$f":"SUM($C11:D11)","v":0},{"$f":"SUM($C11:E11)","v":0},{"$f":"SUM($C11:F11)","v":0},{"$f":"SUM($C11:G11)","v":0},{"$f":"SUM($C11:H11)","v":0},{"$f":"SUM($C11:I11)","v":0},{"$f":"SUM($C11:J11)","v":0},{"$f":"SUM($C11:K11)","v":0},{"$f":"SUM($C11:L11)","v":0},{"$f":"SUM($C11:M11)","v":0},{"$f":"SUM($C11:N11)","v":0},{"$f":"SUM($C11:O11)","v":0},{"$f":"SUM($C11:P11)","v":0},{"$f":"SUM($C11:Q11)","v":0},{"$f":"SUM($C11:R11)","v":0},{"$f":"SUM($C11:S11)","v":0}]
[null,{"$f":"'Week 1'!A19","v":"<Enter Participant 9>"},0,0,0,0,0,0,0,0,0,0,0,0,0,0,0,0,0,{"$f":"SUM($C12:C12)","v":0},{"$f":"SUM($C12:D12)","v":0},{"$f":"SUM($C12:E12)","v":0},{"$f":"SUM($C12:F12)","v":0},{"$f":"SUM($C12:G12)","v":0},{"$f":"SUM($C12:H12)","v":0},{"$f":"SUM($C12:I12)","v":0},{"$f":"SUM($C12:J12)","v":0},{"$f":"SUM($C12:K12)","v":0},{"$f":"SUM($C12:L12)","v":0},{"$f":"SUM($C12:M12)","v":0},{"$f":"SUM($C12:N12)","v":0},{"$f":"SUM($C12:O12)","v":0},{"$f":"SUM($C12:P12)","v":0},{"$f":"SUM($C12:Q12)","v":0},{"$f":"SUM($C12:R12)","v":0},{"$f":"SUM($C12:S12)","v":0}]
[null,{"$f":"'Week 1'!A20","v":"<Enter Participant 10>"},0,0,0,0,0,0,0,0,0,0,0,0,0,0,0,0,0,{"$f":"SUM($C13:C13)","v":0},{"$f":"SUM($C13:D13)","v":0},{"$f":"SUM($C13:E13)","v":0},{"$f":"SUM($C13:F13)","v":0},{"$f":"SUM($C13:G13)","v":0},{"$f":"SUM($C13:H13)","v":0},{"$f":"SUM($C13:I13)","v":0},{"$f":"SUM($C13:J13)","v":0},{"$f":"SUM($C13:K13)","v":0},{"$f":"SUM($C13:L13)","v":0},{"$f":"SUM($C13:M13)","v":0},{"$f":"SUM($C13:N13)","v":0},{"$f":"SUM($C13:O13)","v":0},{"$f":"SUM($C13:P13)","v":0},{"$f":"SUM($C13:Q13)","v":0},{"$f":"SUM($C13:R13)","v":0},{"$f":"SUM($C13:S13)","v":0}]
[null,{"$f":"'Week 1'!A21","v":"<Enter Participant 11>"},0,0,0,0,0,0,0,0,0,0,0,0,0,0,0,0,0,{"$f":"SUM($C14:C14)","v":0},{"$f":"SUM($C14:D14)","v":0},{"$f":"SUM($C14:E14)","v":0},{"$f":"SUM($C14:F14)","v":0},{"$f":"SUM($C14:G14)","v":0},{"$f":"SUM($C14:H14)","v":0},{"$f":"SUM($C14:I14)","v":0},{"$f":"SUM($C14:J14)","v":0},{"$f":"SUM($C14:K14)","v":0},{"$f":"SUM($C14:L14)","v":0},{"$f":"SUM($C14:M14)","v":0},{"$f":"SUM($C14:N14)","v":0},{"$f":"SUM($C14:O14)","v":0},{"$f":"SUM($C14:P14)","v":0},{"$f":"SUM($C14:Q14)","v":0},{"$f":"SUM($C14:R14)","v":0},{"$f":"SUM($C14:S14)","v":0}]
[null,{"$f":"'Week 1'!A22","v":"<Enter Participant 12>"},0,0,0,0,0,0,0,0,0,0,0,0,0,0,0,0,0,{"$f":"SUM($C15:C15)","v":0},{"$f":"SUM($C15:D15)","v":0},{"$f":"SUM($C15:E15)","v":0},{"$f":"SUM($C15:F15)","v":0},{"$f":"SUM($C15:G15)","v":0},{"$f":"SUM($C15:H15)","v":0},{"$f":"SUM($C15:I15)","v":0},{"$f":"SUM($C15:J15)","v":0},{"$f":"SUM($C15:K15)","v":0},{"$f":"SUM($C15:L15)","v":0},{"$f":"SUM($C15:M15)","v":0},{"$f":"SUM($C15:N15)","v":0},{"$f":"SUM($C15:O15)","v":0},{"$f":"SUM($C15:P15)","v":0},{"$f":"SUM($C15:Q15)","v":0},{"$f":"SUM($C15:R15)","v":0},{"$f":"SUM($C15:S15)","v":0}]
[null,{"$f":"'Week 1'!A23","v":"<Enter Participant 13>"},0,0,0,0,0,0,0,0,0,0,0,0,0,0,0,0,0,{"$f":"SUM($C16:C16)","v":0},{"$f":"SUM($C16:D16)","v":0},{"$f":"SUM($C16:E16)","v":0},{"$f":"SUM($C16:F16)","v":0},{"$f":"SUM($C16:G16)","v":0},{"$f":"SUM($C16:H16)","v":0},{"$f":"SUM($C16:I16)","v":0},{"$f":"SUM($C16:J16)","v":0},{"$f":"SUM($C16:K16)","v":0},{"$f":"SUM($C16:L16)","v":0},{"$f":"SUM($C16:M16)","v":0},{"$f":"SUM($C16:N16)","v":0},{"$f":"SUM($C16:O16)","v":0},{"$f":"SUM($C16:P16)","v":0},{"$f":"SUM($C16:Q16)","v":0},{"$f":"SUM($C16:R16)","v":0},{"$f":"SUM($C16:S16)","v":0}]
[null,{"$f":"'Week 1'!A24","v":"<Enter Participant 14>"},0,0,0,0,0,0,0,0,0,0,0,0,0,0,0,0,0,{"$f":"SUM($C17:C17)","v":0},{"$f":"SUM($C17:D17)","v":0},{"$f":"SUM($C17:E17)","v":0},{"$f":"SUM($C17:F17)","v":0},{"$f":"SUM($C17:G17)","v":0},{"$f":"SUM($C17:H17)","v":0},{"$f":"SUM($C17:I17)","v":0},{"$f":"SUM($C17:J17)","v":0},{"$f":"SUM($C17:K17)","v":0},{"$f":"SUM($C17:L17)","v":0},{"$f":"SUM($C17:M17)","v":0},{"$f":"SUM($C17:N17)","v":0},{"$f":"SUM($C17:O17)","v":0},{"$f":"SUM($C17:P17)","v":0},{"$f":"SUM($C17:Q17)","v":0},{"$f":"SUM($C17:R17)","v":0},{"$f":"SUM($C17:S17)","v":0}]
[null,{"$f":"'Week 1'!A25","v":"<Enter Participant 15>"},0,0,0,0,0,0,0,0,0,0,0,0,0,0,0,0,0,{"$f":"SUM($C18:C18)","v":0},{"$f":"SUM($C18:D18)","v":0},{"$f":"SUM($C18:E18)","v":0},{"$f":"SUM($C18:F18)","v":0},{"$f":"SUM($C18:G18)","v":0},{"$f":"SUM($C18:H18)","v":0},{"$f":"SUM($C18:I18)","v":0},{"$f":"SUM($C18:J18)","v":0},{"$f":"SUM($C18:K18)","v":0},{"$f":"SUM($C18:L18)","v":0},{"$f":"SUM($C18:M18)","v":0},{"$f":"SUM($C18:N18)","v":0},{"$f":"SUM($C18:O18)","v":0},{"$f":"SUM($C18:P18)","v":0},{"$f":"SUM($C18:Q18)","v":0},{"$f":"SUM($C18:R18)","v":0},{"$f":"SUM($C18:S18)","v":0}]
[null,{"$f":"'Week 1'!A26","v":"<Enter Participant 16>"},0,0,0,0,0,0,0,0,0,0,0,0,0,0,0,0,{"$f":"IF(VLOOKUP($B19,INDIRECT(\"'\"&S$3&\"'!$A$10:$T$110\"),20,FALSE)=\"\",0,VLOOKUP($B19,INDIRECT(\"'\"&S$3&\"'!$A$10:$T$110\"),20,FALSE))","v":0},{"$f":"SUM($C19:C19)","v":0},{"$f":"SUM($C19:D19)","v":0},{"$f":"SUM($C19:E19)","v":0},{"$f":"SUM($C19:F19)","v":0},{"$f":"SUM($C19:G19)","v":0},{"$f":"SUM($C19:H19)","v":0},{"$f":"SUM($C19:I19)","v":0},{"$f":"SUM($C19:J19)","v":0},{"$f":"SUM($C19:K19)","v":0},{"$f":"SUM($C19:L19)","v":0},{"$f":"SUM($C19:M19)","v":0},{"$f":"SUM($C19:N19)","v":0},{"$f":"SUM($C19:O19)","v":0},{"$f":"SUM($C19:P19)","v":0},{"$f":"SUM($C19:Q19)","v":0},{"$f":"SUM($C19:R19)","v":0},{"$f":"SUM($C19:S19)","v":0}]
[null,{"$f":"'Week 1'!A27","v":"<Enter Participant 17>"},0,0,0,0,0,0,0,0,0,0,0,0,0,0,0,0,0,{"$f":"SUM($C20:C20)","v":0},{"$f":"SUM($C20:D20)","v":0},{"$f":"SUM($C20:E20)","v":0},{"$f":"SUM($C20:F20)","v":0},{"$f":"SUM($C20:G20)","v":0},{"$f":"SUM($C20:H20)","v":0},{"$f":"SUM($C20:I20)","v":0},{"$f":"SUM($C20:J20)","v":0},{"$f":"SUM($C20:K20)","v":0},{"$f":"SUM($C20:L20)","v":0},{"$f":"SUM($C20:M20)","v":0},{"$f":"SUM($C20:N20)","v":0},{"$f":"SUM($C20:O20)","v":0},{"$f":"SUM($C20:P20)","v":0},{"$f":"SUM($C20:Q20)","v":0},{"$f":"SUM($C20:R20)","v":0},{"$f":"SUM($C20:S20)","v":0}]
[null,{"$f":"'Week 1'!A28","v":"<Enter Participant 18>"},{"$f":"IF(VLOOKUP($B21,INDIRECT(\"'\"&C$3&\"'!$A$10:$T$110\"),20,FALSE)=\"\",0,VLOOKUP($B21,INDIRECT(\"'\"&C$3&\"'!$A$10:$T$110\"),20,FALSE))","v":0},0,0,0,0,0,0,0,0,0,0,0,0,0,0,0,0,{"$f":"SUM($C21:C21)","v":0},{"$f":"SUM($C21:D21)","v":0},{"$f":"SUM($C21:E21)","v":0},{"$f":"SUM($C21:F21)","v":0},{"$f":"SUM($C21:G21)","v":0},{"$f":"SUM($C21:H21)","v":0},{"$f":"SUM($C21:I21)","v":0},{"$f":"SUM($C21:J21)","v":0},{"$f":"SUM($C21:K21)","v":0},{"$f":"SUM($C21:L21)","v":0},{"$f":"SUM($C21:M21)","v":0},{"$f":"SUM($C21:N21)","v":0},{"$f":"SUM($C21:O21)","v":0},{"$f":"SUM($C21:P21)","v":0},{"$f":"SUM($C21:Q21)","v":0},{"$f":"SUM($C21:R21)","v":0},{"$f":"SUM($C21:S21)","v":0}]
[null,{"$f":"'Week 1'!A29","v":"<Enter Participant 19>"},0,0,0,0,0,0,0,0,0,0,0,0,0,0,0,0,0,{"$f":"SUM($C22:C22)","v":0},{"$f":"SUM($C22:D22)","v":0},{"$f":"SUM($C22:E22)","v":0},{"$f":"SUM($C22:F22)","v":0},{"$f":"SUM($C22:G22)","v":0},{"$f":"SUM($C22:H22)","v":0},{"$f":"SUM($C22:I22)","v":0},{"$f":"SUM($C22:J22)","v":0},{"$f":"SUM($C22:K22)","v":0},{"$f":"SUM($C22:L22)","v":0},{"$f":"SUM($C22:M22)","v":0},{"$f":"SUM($C22:N22)","v":0},{"$f":"SUM($C22:O22)","v":0},{"$f":"SUM($C22:P22)","v":0},{"$f":"SUM($C22:Q22)","v":0},{"$f":"SUM($C22:R22)","v":0},{"$f":"SUM($C22:S22)","v":0}]
[null,{"$f":"'Week 1'!A30","v":"<Enter Participant 20>"},0,0,0,0,0,0,0,0,0,0,0,0,0,0,0,0,0,{"$f":"SUM($C23:C23)","v":0},{"$f":"SUM($C23:D23)","v":0},{"$f":"SUM($C23:E23)","v":0},{"$f":"SUM($C23:F23)","v":0},{"$f":"SUM($C23:G23)","v":0},{"$f":"SUM($C23:H23)","v":0},{"$f":"SUM($C23:I23)","v":0},{"$f":"SUM($C23:J23)","v":0},{"$f":"SUM($C23:K23)","v":0},{"$f":"SUM($C23:L23)","v":0},{"$f":"SUM($C23:M23)","v":0},{"$f":"SUM($C23:N23)","v":0},{"$f":"SUM($C23:O23)","v":0},{"$f":"SUM($C23:P23)","v":0},{"$f":"SUM($C23:Q23)","v":0},{"$f":"SUM($C23:R23)","v":0},{"$f":"SUM($C23:S23)","v":0}]
[null,{"$f":"'Week 1'!A31","v":"<Enter Participant 21>"},0,0,0,0,0,0,0,0,0,0,0,0,0,0,0,0,0,{"$f":"SUM($C24:C24)","v":0},{"$f":"SUM($C24:D24)","v":0},{"$f":"SUM($C24:E24)","v":0},{"$f":"SUM($C24:F24)","v":0},{"$f":"SUM($C24:G24)","v":0},{"$f":"SUM($C24:H24)","v":0},{"$f":"SUM($C24:I24)","v":0},{"$f":"SUM($C24:J24)","v":0},{"$f":"SUM($C24:K24)","v":0},{"$f":"SUM($C24:L24)","v":0},{"$f":"SUM($C24:M24)","v":0},{"$f":"SUM($C24:N24)","v":0},{"$f":"SUM($C24:O24)","v":0},{"$f":"SUM($C24:P24)","v":0},{"$f":"SUM($C24:Q24)","v":0},{"$f":"SUM($C24:R24)","v":0},{"$f":"SUM($C24:S24)","v":0}]
[null,{"$f":"'Week 1'!A32","v":"<Enter Participant 22>"},0,0,0,0,0,0,0,0,0,0,0,0,0,0,0,0,0,{"$f":"SUM($C25:C25)","v":0},{"$f":"SUM($C25:D25)","v":0},{"$f":"SUM($C25:E25)","v":0},{"$f":"SUM($C25:F25)","v":0},{"$f":"SUM($C25:G25)","v":0},{"$f":"SUM($C25:H25)","v":0},{"$f":"SUM($C25:I25)","v":0},{"$f":"SUM($C25:J25)","v":0},{"$f":"SUM($C25:K25)","v":0},{"$f":"SUM($C25:L25)","v":0},{"$f":"SUM($C25:M25)","v":0},{"$f":"SUM($C25:N25)","v":0},{"$f":"SUM($C25:O25)","v":0},{"$f":"SUM($C25:P25)","v":0},{"$f":"SUM($C25:Q25)","v":0},{"$f":"SUM($C25:R25)","v":0},{"$f":"SUM($C25:S25)","v":0}]
[null,{"$f":"'Week 1'!A33","v":"<Enter Participant 23>"},0,0,0,0,0,0,0,0,0,0,0,0,0,0,0,0,0,{"$f":"SUM($C26:C26)","v":0},{"$f":"SUM($C26:D26)","v":0},{"$f":"SUM($C26:E26)","v":0},{"$f":"SUM($C26:F26)","v":0},{"$f":"SUM($C26:G26)","v":0},{"$f":"SUM($C26:H26)","v":0},{"$f":"SUM($C26:I26)","v":0},{"$f":"SUM($C26:J26)","v":0},{"$f":"SUM($C26:K26)","v":0},{"$f":"SUM($C26:L26)","v":0},{"$f":"SUM($C26:M26)","v":0},{"$f":"SUM($C26:N26)","v":0},{"$f":"SUM($C26:O26)","v":0},{"$f":"SUM($C26:P26)","v":0},{"$f":"SUM($C26:Q26)","v":0},{"$f":"SUM($C26:R26)","v":0},{"$f":"SUM($C26:S26)","v":0}]
[null,{"$f":"'Week 1'!A34","v":"<Enter Participant 24>"},0,0,0,0,0,0,0,0,0,0,0,0,0,0,0,0,0,{"$f":"SUM($C27:C27)","v":0},{"$f":"SUM($C27:D27)","v":0},{"$f":"SUM($C27:E27)","v":0},{"$f":"SUM($C27:F27)","v":0},{"$f":"SUM($C27:G27)","v":0},{"$f":"SUM($C27:H27)","v":0},{"$f":"SUM($C27:I27)","v":0},{"$f":"SUM($C27:J27)","v":0},{"$f":"SUM($C27:K27)","v":0},{"$f":"SUM($C27:L27)","v":0},{"$f":"SUM($C27:M27)","v":0},{"$f":"SUM($C27:N27)","v":0},{"$f":"SUM($C27:O27)","v":0},{"$f":"SUM($C27:P27)","v":0},{"$f":"SUM($C27:Q27)","v":0},{"$f":"SUM($C27:R27)","v":0},{"$f":"SUM($C27:S27)","v":0}]
[null,{"$f":"'Week 1'!A35","v":"<Enter Participant 25>"},0,0,0,0,0,0,0,0,0,0,0,0,0,0,0,0,0,{"$f":"SUM($C28:C28)","v":0},{"$f":"SUM($C28:D28)","v":0},{"$f":"SUM($C28:E28)","v":0},{"$f":"SUM($C28:F28)","v":0},{"$f":"SUM($C28:G28)","v":0},{"$f":"SUM($C28:H28)","v":0},{"$f":"SUM($C28:I28)","v":0},{"$f":"SUM($C28:J28)","v":0},{"$f":"SUM($C28:K28)","v":0},{"$f":"SUM($C28:L28)","v":0},{"$f":"SUM($C28:M28)","v":0},{"$f":"SUM($C28:N28)","v":0},{"$f":"SUM($C28:O28)","v":0},{"$f":"SUM($C28:P28)","v":0},{"$f":"SUM($C28:Q28)","v":0},{"$f":"SUM($C28:R28)","v":0},{"$f":"SUM($C28:S28)","v":0}]
[null,{"$f":"'Week 1'!A36","v":"<Enter Participant 26>"},0,0,0,0,0,0,0,0,0,0,0,0,0,0,0,0,0,{"$f":"SUM($C29:C29)","v":0},{"$f":"SUM($C29:D29)","v":0},{"$f":"SUM($C29:E29)","v":0},{"$f":"SUM($C29:F29)","v":0},{"$f":"SUM($C29:G29)","v":0},{"$f":"SUM($C29:H29)","v":0},{"$f":"SUM($C29:I29)","v":0},{"$f":"SUM($C29:J29)","v":0},{"$f":"SUM($C29:K29)","v":0},{"$f":"SUM($C29:L29)","v":0},{"$f":"SUM($C29:M29)","v":0},{"$f":"SUM($C29:N29)","v":0},{"$f":"SUM($C29:O29)","v":0},{"$f":"SUM($C29:P29)","v":0},{"$f":"SUM($C29:Q29)","v":0},{"$f":"SUM($C29:R29)","v":0},{"$f":"SUM($C29:S29)","v":0}]
[null,{"$f":"'Week 1'!A37","v":"<Enter Participant 27>"},0,0,0,0,0,0,0,0,0,0,0,0,0,0,0,0,0,{"$f":"SUM($C30:C30)","v":0},{"$f":"SUM($C30:D30)","v":0},{"$f":"SUM($C30:E30)","v":0},{"$f":"SUM($C30:F30)","v":0},{"$f":"SUM($C30:G30)","v":0},{"$f":"SUM($C30:H30)","v":0},{"$f":"SUM($C30:I30)","v":0},{"$f":"SUM($C30:J30)","v":0},{"$f":"SUM($C30:K30)","v":0},{"$f":"SUM($C30:L30)","v":0},{"$f":"SUM($C30:M30)","v":0},{"$f":"SUM($C30:N30)","v":0},{"$f":"SUM($C30:O30)","v":0},{"$f":"SUM($C30:P30)","v":0},{"$f":"SUM($C30:Q30)","v":0},{"$f":"SUM($C30:R30)","v":0},{"$f":"SUM($C30:S30)","v":0}]
[null,{"$f":"'Week 1'!A38","v":"<Enter Participant 28>"},0,0,0,0,0,0,0,0,0,0,0,0,0,0,0,0,0,{"$f":"SUM($C31:C31)","v":0},{"$f":"SUM($C31:D31)","v":0},{"$f":"SUM($C31:E31)","v":0},{"$f":"SUM($C31:F31)","v":0},{"$f":"SUM($C31:G31)","v":0},{"$f":"SUM($C31:H31)","v":0},{"$f":"SUM($C31:I31)","v":0},{"$f":"SUM($C31:J31)","v":0},{"$f":"SUM($C31:K31)","v":0},{"$f":"SUM($C31:L31)","v":0},{"$f":"SUM($C31:M31)","v":0},{"$f":"SUM($C31:N31)","v":0},{"$f":"SUM($C31:O31)","v":0},{"$f":"SUM($C31:P31)","v":0},{"$f":"SUM($C31:Q31)","v":0},{"$f":"SUM($C31:R31)","v":0},{"$f":"SUM($C31:S31)","v":0}]
[null,{"$f":"'Week 1'!A39","v":"<Enter Participant 29>"},0,0,0,0,0,0,0,0,0,0,0,0,0,0,0,0,0,{"$f":"SUM($C32:C32)","v":0},{"$f":"SUM($C32:D32)","v":0},{"$f":"SUM($C32:E32)","v":0},{"$f":"SUM($C32:F32)","v":0},{"$f":"SUM($C32:G32)","v":0},{"$f":"SUM($C32:H32)","v":0},{"$f":"SUM($C32:I32)","v":0},{"$f":"SUM($C32:J32)","v":0},{"$f":"SUM($C32:K32)","v":0},{"$f":"SUM($C32:L32)","v":0},{"$f":"SUM($C32:M32)","v":0},{"$f":"SUM($C32:N32)","v":0},{"$f":"SUM($C32:O32)","v":0},{"$f":"SUM($C32:P32)","v":0},{"$f":"SUM($C32:Q32)","v":0},{"$f":"SUM($C32:R32)","v":0},{"$f":"SUM($C32:S32)","v":0}]
[null,{"$f":"'Week 1'!A40","v":"<Enter Participant 30>"},0,0,0,0,0,0,0,0,0,0,0,0,0,0,0,0,0,{"$f":"SUM($C33:C33)","v":0},{"$f":"SUM($C33:D33)","v":0},{"$f":"SUM($C33:E33)","v":0},{"$f":"SUM($C33:F33)","v":0},{"$f":"SUM($C33:G33)","v":0},{"$f":"SUM($C33:H33)","v":0},{"$f":"SUM($C33:I33)","v":0},{"$f":"SUM($C33:J33)","v":0},{"$f":"SUM($C33:K33)","v":0},{"$f":"SUM($C33:L33)","v":0},{"$f":"SUM($C33:M33)","v":0},{"$f":"SUM($C33:N33)","v":0},{"$f":"SUM($C33:O33)","v":0},{"$f":"SUM($C33:P33)","v":0},{"$f":"SUM($C33:Q33)","v":0},{"$f":"SUM($C33:R33)","v":0},{"$f":"SUM($C33:S33)","v":0}]
[null,{"$f":"'Week 1'!A41","v":"<Enter Participant 31>"},0,0,0,0,0,0,0,0,0,0,0,0,0,0,0,0,0,{"$f":"SUM($C34:C34)","v":0},{"$f":"SUM($C34:D34)","v":0},{"$f":"SUM($C34:E34)","v":0},{"$f":"SUM($C34:F34)","v":0},{"$f":"SUM($C34:G34)","v":0},{"$f":"SUM($C34:H34)","v":0},{"$f":"SUM($C34:I34)","v":0},{"$f":"SUM($C34:J34)","v":0},{"$f":"SUM($C34:K34)","v":0},{"$f":"SUM($C34:L34)","v":0},{"$f":"SUM($C34:M34)","v":0},{"$f":"SUM($C34:N34)","v":0},{"$f":"SUM($C34:O34)","v":0},{"$f":"SUM($C34:P34)","v":0},{"$f":"SUM($C34:Q34)","v":0},{"$f":"SUM($C34:R34)","v":0},{"$f":"SUM($C34:S34)","v":0}]
[null,{"$f":"'Week 1'!A42","v":"<Enter Participant 32>"},0,0,0,0,0,0,0,0,0,0,0,0,0,0,0,0,0,{"$f":"SUM($C35:C35)","v":0},{"$f":"SUM($C35:D35)","v":0},{"$f":"SUM($C35:E35)","v":0},{"$f":"SUM($C35:F35)","v":0},{"$f":"SUM($C35:G35)","v":0},{"$f":"SUM($C35:H35)","v":0},{"$f":"SUM($C35:I35)","v":0},{"$f":"SUM($C35:J35)","v":0},{"$f":"SUM($C35:K35)","v":0},{"$f":"SUM($C35:L35)","v":0},{"$f":"SUM($C35:M35)","v":0},{"$f":"SUM($C35:N35)","v":0},{"$f":"SUM($C35:O35)","v":0},{"$f":"SUM($C35:P35)","v":0},{"$f":"SUM($C35:Q35)","v":0},{"$f":"SUM($C35:R35)","v":0},{"$f":"SUM($C35:S35)","v":0}]
[null,{"$f":"'Week 1'!A43","v":"<Enter Participant 33>"},0,0,0,0,0,0,0,0,0,0,0,0,0,0,0,{"$f":"IF(VLOOKUP($B36,INDIRECT(\"'\"&R$3&\"'!$A$10:$T$110\"),20,FALSE)=\"\",0,VLOOKUP($B36,INDIRECT(\"'\"&R$3&\"'!$A$10:$T$110\"),20,FALSE))","v":0},0,{"$f":"SUM($C36:C36)","v":0},{"$f":"SUM($C36:D36)","v":0},{"$f":"SUM($C36:E36)","v":0},{"$f":"SUM($C36:F36)","v":0},{"$f":"SUM($C36:G36)","v":0},{"$f":"SUM($C36:H36)","v":0},{"$f":"SUM($C36:I36)","v":0},{"$f":"SUM($C36:J36)","v":0},{"$f":"SUM($C36:K36)","v":0},{"$f":"SUM($C36:L36)","v":0},{"$f":"SUM($C36:M36)","v":0},{"$f":"SUM($C36:N36)","v":0},{"$f":"SUM($C36:O36)","v":0},{"$f":"SUM($C36:P36)","v":0},{"$f":"SUM($C36:Q36)","v":0},{"$f":"SUM($C36:R36)","v":0},{"$f":"SUM($C36:S36)","v":0}]
[null,{"$f":"'Week 1'!A44","v":"<Enter Participant 34>"},{"$f":"IF(VLOOKUP($B37,INDIRECT(\"'\"&C$3&\"'!$A$10:$T$110\"),20,FALSE)=\"\",0,VLOOKUP($B37,INDIRECT(\"'\"&C$3&\"'!$A$10:$T$110\"),20,FALSE))","v":0},0,0,0,0,0,0,0,0,0,0,0,0,0,0,0,0,{"$f":"SUM($C37:C37)","v":0},{"$f":"SUM($C37:D37)","v":0},{"$f":"SUM($C37:E37)","v":0},{"$f":"SUM($C37:F37)","v":0},{"$f":"SUM($C37:G37)","v":0},{"$f":"SUM($C37:H37)","v":0},{"$f":"SUM($C37:I37)","v":0},{"$f":"SUM($C37:J37)","v":0},{"$f":"SUM($C37:K37)","v":0},{"$f":"SUM($C37:L37)","v":0},{"$f":"SUM($C37:M37)","v":0},{"$f":"SUM($C37:N37)","v":0},{"$f":"SUM($C37:O37)","v":0},{"$f":"SUM($C37:P37)","v":0},{"$f":"SUM($C37:Q37)","v":0},{"$f":"SUM($C37:R37)","v":0},{"$f":"SUM($C37:S37)","v":0}]
[null,{"$f":"'Week 1'!A45","v":"<Enter Participant 35>"},0,0,0,0,0,0,0,0,0,0,0,0,0,0,0,0,0,{"$f":"SUM($C38:C38)","v":0},{"$f":"SUM($C38:D38)","v":0},{"$f":"SUM($C38:E38)","v":0},{"$f":"SUM($C38:F38)","v":0},{"$f":"SUM($C38:G38)","v":0},{"$f":"SUM($C38:H38)","v":0},{"$f":"SUM($C38:I38)","v":0},{"$f":"SUM($C38:J38)","v":0},{"$f":"SUM($C38:K38)","v":0},{"$f":"SUM($C38:L38)","v":0},{"$f":"SUM($C38:M38)","v":0},{"$f":"SUM($C38:N38)","v":0},{"$f":"SUM($C38:O38)","v":0},{"$f":"SUM($C38:P38)","v":0},{"$f":"SUM($C38:Q38)","v":0},{"$f":"SUM($C38:R38)","v":0},{"$f":"SUM($C38:S38)","v":0}]
[null,{"$f":"'Week 1'!A46","v":"<Enter Participant 36>"},0,0,0,0,0,0,0,0,0,0,0,0,0,0,0,0,0,{"$f":"SUM($C39:C39)","v":0},{"$f":"SUM($C39:D39)","v":0},{"$f":"SUM($C39:E39)","v":0},{"$f":"SUM($C39:F39)","v":0},{"$f":"SUM($C39:G39)","v":0},{"$f":"SUM($C39:H39)","v":0},{"$f":"SUM($C39:I39)","v":0},{"$f":"SUM($C39:J39)","v":0},{"$f":"SUM($C39:K39)","v":0},{"$f":"SUM($C39:L39)","v":0},{"$f":"SUM($C39:M39)","v":0},{"$f":"SUM($C39:N39)","v":0},{"$f":"SUM($C39:O39)","v":0},{"$f":"SUM($C39:P39)","v":0},{"$f":"SUM($C39:Q39)","v":0},{"$f":"SUM($C39:R39)","v":0},{"$f":"SUM($C39:S39)","v":0}]
[null,{"$f":"'Week 1'!A47","v":"<Enter Participant 37>"},0,0,0,0,0,0,0,0,0,0,0,0,0,0,0,0,0,{"$f":"SUM($C40:C40)","v":0},{"$f":"SUM($C40:D40)","v":0},{"$f":"SUM($C40:E40)","v":0},{"$f":"SUM($C40:F40)","v":0},{"$f":"SUM($C40:G40)","v":0},{"$f":"SUM($C40:H40)","v":0},{"$f":"SUM($C40:I40)","v":0},{"$f":"SUM($C40:J40)","v":0},{"$f":"SUM($C40:K40)","v":0},{"$f":"SUM($C40:L40)","v":0},{"$f":"SUM($C40:M40)","v":0},{"$f":"SUM($C40:N40)","v":0},{"$f":"SUM($C40:O40)","v":0},{"$f":"SUM($C40:P40)","v":0},{"$f":"SUM($C40:Q40)","v":0},{"$f":"SUM($C40:R40)","v":0},{"$f":"SUM($C40:S40)","v":0}]
[null,{"$f":"'Week 1'!A48","v":"<Enter Participant 38>"},0,0,0,0,0,0,0,0,0,0,0,0,0,0,0,0,0,{"$f":"SUM($C41:C41)","v":0},{"$f":"SUM($C41:D41)","v":0},{"$f":"SUM($C41:E41)","v":0},{"$f":"SUM($C41:F41)","v":0},{"$f":"SUM($C41:G41)","v":0},{"$f":"SUM($C41:H41)","v":0},{"$f":"SUM($C41:I41)","v":0},{"$f":"SUM($C41:J41)","v":0},{"$f":"SUM($C41:K41)","v":0},{"$f":"SUM($C41:L41)","v":0},{"$f":"SUM($C41:M41)","v":0},{"$f":"SUM($C41:N41)","v":0},{"$f":"SUM($C41:O41)","v":0},{"$f":"SUM($C41:P41)","v":0},{"$f":"SUM($C41:Q41)","v":0},{"$f":"SUM($C41:R41)","v":0},{"$f":"SUM($C41:S41)","v":0}]
[null,{"$f":"'Week 1'!A49","v":"<Enter Participant 39>"},0,0,0,0,0,0,0,0,0,0,0,0,0,0,0,0,0,{"$f":"SUM($C42:C42)","v":0},{"$f":"SUM($C42:D42)","v":0},{"$f":"SUM($C42:E42)","v":0},{"$f":"SUM($C42:F42)","v":0},{"$f":"SUM($C42:G42)","v":0},{"$f":"SUM($C42:H42)","v":0},{"$f":"SUM($C42:I42)","v":0},{"$f":"SUM($C42:J42)","v":0},{"$f":"SUM($C42:K42)","v":0},{"$f":"SUM($C42:L42)","v":0},{"$f":"SUM($C42:M42)","v":0},{"$f":"SUM($C42:N42)","v":0},{"$f":"SUM($C42:O42)","v":0},{"$f":"SUM($C42:P42)","v":0},{"$f":"SUM($C42:Q42)","v":0},{"$f":"SUM($C42:R42)","v":0},{"$f":"SUM($C42:S42)","v":0}]
[null,{"$f":"'Week 1'!A50","v":"<Enter Participant 40>"},0,0,0,0,0,0,0,0,0,0,0,0,0,0,0,0,0,{"$f":"SUM($C43:C43)","v":0},{"$f":"SUM($C43:D43)","v":0},{"$f":"SUM($C43:E43)","v":0},{"$f":"SUM($C43:F43)","v":0},{"$f":"SUM($C43:G43)","v":0},{"$f":"SUM($C43:H43)","v":0},{"$f":"SUM($C43:I43)","v":0},{"$f":"SUM($C43:J43)","v":0},{"$f":"SUM($C43:K43)","v":0},{"$f":"SUM($C43:L43)","v":0},{"$f":"SUM($C43:M43)","v":0},{"$f":"SUM($C43:N43)","v":0},{"$f":"SUM($C43:O43)","v":0},{"$f":"SUM($C43:P43)","v":0},{"$f":"SUM($C43:Q43)","v":0},{"$f":"SUM($C43:R43)","v":0},{"$f":"SUM($C43:S43)","v":0}]
[null,{"$f":"'Week 1'!A51","v":"<Enter Participant 41>"},0,0,0,0,0,0,0,0,0,0,0,0,0,0,0,0,0,{"$f":"SUM($C44:C44)","v":0},{"$f":"SUM($C44:D44)","v":0},{"$f":"SUM($C44:E44)","v":0},{"$f":"SUM($C44:F44)","v":0},{"$f":"SUM($C44:G44)","v":0},{"$f":"SUM($C44:H44)","v":0},{"$f":"SUM($C44:I44)","v":0},{"$f":"SUM($C44:J44)","v":0},{"$f":"SUM($C44:K44)","v":0},{"$f":"SUM($C44:L44)","v":0},{"$f":"SUM($C44:M44)","v":0},{"$f":"SUM($C44:N44)","v":0},{"$f":"SUM($C44:O44)","v":0},{"$f":"SUM($C44:P44)","v":0},{"$f":"SUM($C44:Q44)","v":0},{"$f":"SUM($C44:R44)","v":0},{"$f":"SUM($C44:S44)","v":0}]
[null,{"$f":"'Week 1'!A52","v":"<Enter Participant 42>"},0,0,0,0,0,0,0,0,0,0,0,0,0,0,0,0,0,{"$f":"SUM($C45:C45)","v":0},{"$f":"SUM($C45:D45)","v":0},{"$f":"SUM($C45:E45)","v":0},{"$f":"SUM($C45:F45)","v":0},{"$f":"SUM($C45:G45)","v":0},{"$f":"SUM($C45:H45)","v":0},{"$f":"SUM($C45:I45)","v":0},{"$f":"SUM($C45:J45)","v":0},{"$f":"SUM($C45:K45)","v":0},{"$f":"SUM($C45:L45)","v":0},{"$f":"SUM($C45:M45)","v":0},{"$f":"SUM($C45:N45)","v":0},{"$f":"SUM($C45:O45)","v":0},{"$f":"SUM($C45:P45)","v":0},{"$f":"SUM($C45:Q45)","v":0},{"$f":"SUM($C45:R45)","v":0},{"$f":"SUM($C45:S45)","v":0}]
[null,{"$f":"'Week 1'!A53","v":"<Enter Participant 43>"},0,0,0,0,0,0,0,0,0,0,0,0,0,0,0,0,0,{"$f":"SUM($C46:C46)","v":0},{"$f":"SUM($C46:D46)","v":0},{"$f":"SUM($C46:E46)","v":0},{"$f":"SUM($C46:F46)","v":0},{"$f":"SUM($C46:G46)","v":0},{"$f":"SUM($C46:H46)","v":0},{"$f":"SUM($C46:I46)","v":0},{"$f":"SUM($C46:J46)","v":0},{"$f":"SUM($C46:K46)","v":0},{"$f":"SUM($C46:L46)","v":0},{"$f":"SUM($C46:M46)","v":0},{"$f":"SUM($C46:N46)","v":0},{"$f":"SUM($C46:O46)","v":0},{"$f":"SUM($C46:P46)","v":0},{"$f":"SUM($C46:Q46)","v":0},{"$f":"SUM($C46:R46)","v":0},{"$f":"SUM($C46:S46)","v":0}]
[null,{"$f":"'Week 1'!A54","v":"<Enter Participant 44>"},0,0,0,0,0,0,0,0,0,0,0,0,0,0,0,0,0,{"$f":"SUM($C47:C47)","v":0},{"$f":"SUM($C47:D47)","v":0},{"$f":"SUM($C47:E47)","v":0},{"$f":"SUM($C47:F47)","v":0},{"$f":"SUM($C47:G47)","v":0},{"$f":"SUM($C47:H47)","v":0},{"$f":"SUM($C47:I47)","v":0},{"$f":"SUM($C47:J47)","v":0},{"$f":"SUM($C47:K47)","v":0},{"$f":"SUM($C47:L47)","v":0},{"$f":"SUM($C47:M47)","v":0},{"$f":"SUM($C47:N47)","v":0},{"$f":"SUM($C47:O47)","v":0},{"$f":"SUM($C47:P47)","v":0},{"$f":"SUM($C47:Q47)","v":0},{"$f":"SUM($C47:R47)","v":0},{"$f":"SUM($C47:S47)","v":0}]
[null,{"$f":"'Week 1'!A55","v":"<Enter Participant 45>"},0,0,0,0,0,0,0,0,0,0,0,0,0,0,0,0,0,{"$f":"SUM($C48:C48)","v":0},{"$f":"SUM($C48:D48)","v":0},{"$f":"SUM($C48:E48)","v":0},{"$f":"SUM($C48:F48)","v":0},{"$f":"SUM($C48:G48)","v":0},{"$f":"SUM($C48:H48)","v":0},{"$f":"SUM($C48:I48)","v":0},{"$f":"SUM($C48:J48)","v":0},{"$f":"SUM($C48:K48)","v":0},{"$f":"SUM($C48:L48)","v":0},{"$f":"SUM($C48:M48)","v":0},{"$f":"SUM($C48:N48)","v":0},{"$f":"SUM($C48:O48)","v":0},{"$f":"SUM($C48:P48)","v":0},{"$f":"SUM($C48:Q48)","v":0},{"$f":"SUM($C48:R48)","v":0},{"$f":"SUM($C48:S48)","v":0}]
[null,{"$f":"'Week 1'!A56","v":"<Enter Participant 46>"},0,0,0,0,0,0,0,0,0,0,0,0,0,0,0,0,0,{"$f":"SUM($C49:C49)","v":0},{"$f":"SUM($C49:D49)","v":0},{"$f":"SUM($C49:E49)","v":0},{"$f":"SUM($C49:F49)","v":0},{"$f":"SUM($C49:G49)","v":0},{"$f":"SUM($C49:H49)","v":0},{"$f":"SUM($C49:I49)","v":0},{"$f":"SUM($C49:J49)","v":0},{"$f":"SUM($C49:K49)","v":0},{"$f":"SUM($C49:L49)","v":0},{"$f":"SUM($C49:M49)","v":0},{"$f":"SUM($C49:N49)","v":0},{"$f":"SUM($C49:O49)","v":0},{"$f":"SUM($C49:P49)","v":0},{"$f":"SUM($C49:Q49)","v":0},{"$f":"SUM($C49:R49)","v":0},{"$f":"SUM($C49:S49)","v":0}]
[null,{"$f":"'Week 1'!A57","v":"<Enter Participant 47>"},0,0,0,0,0,0,0,0,0,0,0,0,0,0,0,0,0,{"$f":"SUM($C50:C50)","v":0},{"$f":"SUM($C50:D50)","v":0},{"$f":"SUM($C50:E50)","v":0},{"$f":"SUM($C50:F50)","v":0},{"$f":"SUM($C50:G50)","v":0},{"$f":"SUM($C50:H50)","v":0},{"$f":"SUM($C50:I50)","v":0},{"$f":"SUM($C50:J50)","v":0},{"$f":"SUM($C50:K50)","v":0},{"$f":"SUM($C50:L50)","v":0},{"$f":"SUM($C50:M50)","v":0},{"$f":"SUM($C50:N50)","v":0},{"$f":"SUM($C50:O50)","v":0},{"$f":"SUM($C50:P50)","v":0},{"$f":"SUM($C50:Q50)","v":0},{"$f":"SUM($C50:R50)","v":0},{"$f":"SUM($C50:S50)","v":0}]
[null,{"$f":"'Week 1'!A58","v":"<Enter Participant 48>"},0,0,0,0,0,0,0,0,0,0,0,0,0,0,0,0,0,{"$f":"SUM($C51:C51)","v":0},{"$f":"SUM($C51:D51)","v":0},{"$f":"SUM($C51:E51)","v":0},{"$f":"SUM($C51:F51)","v":0},{"$f":"SUM($C51:G51)","v":0},{"$f":"SUM($C51:H51)","v":0},{"$f":"SUM($C51:I51)","v":0},{"$f":"SUM($C51:J51)","v":0},{"$f":"SUM($C51:K51)","v":0},{"$f":"SUM($C51:L51)","v":0},{"$f":"SUM($C51:M51)","v":0},{"$f":"SUM($C51:N51)","v":0},{"$f":"SUM($C51:O51)","v":0},{"$f":"SUM($C51:P51)","v":0},{"$f":"SUM($C51:Q51)","v":0},{"$f":"SUM($C51:R51)","v":0},{"$f":"SUM($C51:S51)","v":0}]
[null,{"$f":"'Week 1'!A59","v":"<Enter Participant 49>"},0,0,0,0,0,0,0,0,0,0,0,0,0,0,0,0,0,{"$f":"SUM($C52:C52)","v":0},{"$f":"SUM($C52:D52)","v":0},{"$f":"SUM($C52:E52)","v":0},{"$f":"SUM($C52:F52)","v":0},{"$f":"SUM($C52:G52)","v":0},{"$f":"SUM($C52:H52)","v":0},{"$f":"SUM($C52:I52)","v":0},{"$f":"SUM($C52:J52)","v":0},{"$f":"SUM($C52:K52)","v":0},{"$f":"SUM($C52:L52)","v":0},{"$f":"SUM($C52:M52)","v":0},{"$f":"SUM($C52:N52)","v":0},{"$f":"SUM($C52:O52)","v":0},{"$f":"SUM($C52:P52)","v":0},{"$f":"SUM($C52:Q52)","v":0},{"$f":"SUM($C52:R52)","v":0},{"$f":"SUM($C52:S52)","v":0}]
[null,{"$f":"'Week 1'!A60","v":"<Enter Participant 50>"},{"$f":"IF(VLOOKUP($B53,INDIRECT(\"'\"&C$3&\"'!$A$10:$T$110\"),20,FALSE)=\"\",0,VLOOKUP($B53,INDIRECT(\"'\"&C$3&\"'!$A$10:$T$110\"),20,FALSE))","v":0},0,0,0,0,0,0,0,0,0,0,0,0,0,0,0,0,{"$f":"SUM($C53:C53)","v":0},{"$f":"SUM($C53:D53)","v":0},{"$f":"SUM($C53:E53)","v":0},{"$f":"SUM($C53:F53)","v":0},{"$f":"SUM($C53:G53)","v":0},{"$f":"SUM($C53:H53)","v":0},{"$f":"SUM($C53:I53)","v":0},{"$f":"SUM($C53:J53)","v":0},{"$f":"SUM($C53:K53)","v":0},{"$f":"SUM($C53:L53)","v":0},{"$f":"SUM($C53:M53)","v":0},{"$f":"SUM($C53:N53)","v":0},{"$f":"SUM($C53:O53)","v":0},{"$f":"SUM($C53:P53)","v":0},{"$f":"SUM($C53:Q53)","v":0},{"$f":"SUM($C53:R53)","v":0},{"$f":"SUM($C53:S53)","v":0}]
[null,{"$f":"'Week 1'!A61","v":"<Enter Participant 51>"},0,0,0,0,0,0,0,0,0,0,0,0,0,0,0,0,0,{"$f":"SUM($C54:C54)","v":0},{"$f":"SUM($C54:D54)","v":0},{"$f":"SUM($C54:E54)","v":0},{"$f":"SUM($C54:F54)","v":0},{"$f":"SUM($C54:G54)","v":0},{"$f":"SUM($C54:H54)","v":0},{"$f":"SUM($C54:I54)","v":0},{"$f":"SUM($C54:J54)","v":0},{"$f":"SUM($C54:K54)","v":0},{"$f":"SUM($C54:L54)","v":0},{"$f":"SUM($C54:M54)","v":0},{"$f":"SUM($C54:N54)","v":0},{"$f":"SUM($C54:O54)","v":0},{"$f":"SUM($C54:P54)","v":0},{"$f":"SUM($C54:Q54)","v":0},{"$f":"SUM($C54:R54)","v":0},{"$f":"SUM($C54:S54)","v":0}]
[null,{"$f":"'Week 1'!A62","v":"<Enter Participant 52>"},0,0,0,0,0,0,0,0,0,0,0,0,0,0,0,0,0,{"$f":"SUM($C55:C55)","v":0},{"$f":"SUM($C55:D55)","v":0},{"$f":"SUM($C55:E55)","v":0},{"$f":"SUM($C55:F55)","v":0},{"$f":"SUM($C55:G55)","v":0},{"$f":"SUM($C55:H55)","v":0},{"$f":"SUM($C55:I55)","v":0},{"$f":"SUM($C55:J55)","v":0},{"$f":"SUM($C55:K55)","v":0},{"$f":"SUM($C55:L55)","v":0},{"$f":"SUM($C55:M55)","v":0},{"$f":"SUM($C55:N55)","v":0},{"$f":"SUM($C55:O55)","v":0},{"$f":"SUM($C55:P55)","v":0},{"$f":"SUM($C55:Q55)","v":0},{"$f":"SUM($C55:R55)","v":0},{"$f":"SUM($C55:S55)","v":0}]
[null,{"$f":"'Week 1'!A63","v":"<Enter Participant 53>"},0,0,0,0,0,0,0,0,0,0,0,0,0,0,0,0,0,{"$f":"SUM($C56:C56)","v":0},{"$f":"SUM($C56:D56)","v":0},{"$f":"SUM($C56:E56)","v":0},{"$f":"SUM($C56:F56)","v":0},{"$f":"SUM($C56:G56)","v":0},{"$f":"SUM($C56:H56)","v":0},{"$f":"SUM($C56:I56)","v":0},{"$f":"SUM($C56:J56)","v":0},{"$f":"SUM($C56:K56)","v":0},{"$f":"SUM($C56:L56)","v":0},{"$f":"SUM($C56:M56)","v":0},{"$f":"SUM($C56:N56)","v":0},{"$f":"SUM($C56:O56)","v":0},{"$f":"SUM($C56:P56)","v":0},{"$f":"SUM($C56:Q56)","v":0},{"$f":"SUM($C56:R56)","v":0},{"$f":"SUM($C56:S56)","v":0}]
[null,{"$f":"'Week 1'!A64","v":"<Enter Participant 54>"},0,0,0,0,0,0,0,0,0,0,0,0,0,0,0,0,0,{"$f":"SUM($C57:C57)","v":0},{"$f":"SUM($C57:D57)","v":0},{"$f":"SUM($C57:E57)","v":0},{"$f":"SUM($C57:F57)","v":0},{"$f":"SUM($C57:G57)","v":0},{"$f":"SUM($C57:H57)","v":0},{"$f":"SUM($C57:I57)","v":0},{"$f":"SUM($C57:J57)","v":0},{"$f":"SUM($C57:K57)","v":0},{"$f":"SUM($C57:L57)","v":0},{"$f":"SUM($C57:M57)","v":0},{"$f":"SUM($C57:N57)","v":0},{"$f":"SUM($C57:O57)","v":0},{"$f":"SUM($C57:P57)","v":0},{"$f":"SUM($C57:Q57)","v":0},{"$f":"SUM($C57:R57)","v":0},{"$f":"SUM($C57:S57)","v":0}]
[null,{"$f":"'Week 1'!A65","v":"<Enter Participant 55>"},0,0,0,0,0,0,0,0,0,0,0,0,0,0,0,0,0,{"$f":"SUM($C58:C58)","v":0},{"$f":"SUM($C58:D58)","v":0},{"$f":"SUM($C58:E58)","v":0},{"$f":"SUM($C58:F58)","v":0},{"$f":"SUM($C58:G58)","v":0},{"$f":"SUM($C58:H58)","v":0},{"$f":"SUM($C58:I58)","v":0},{"$f":"SUM($C58:J58)","v":0},{"$f":"SUM($C58:K58)","v":0},{"$f":"SUM($C58:L58)","v":0},{"$f":"SUM($C58:M58)","v":0},{"$f":"SUM($C58:N58)","v":0},{"$f":"SUM($C58:O58)","v":0},{"$f":"SUM($C58:P58)","v":0},{"$f":"SUM($C58:Q58)","v":0},{"$f":"SUM($C58:R58)","v":0},{"$f":"SUM($C58:S58)","v":0}]
[null,{"$f":"'Week 1'!A66","v":"<Enter Participant 56>"},0,0,0,0,0,0,0,0,0,0,0,0,0,0,0,0,0,{"$f":"SUM($C59:C59)","v":0},{"$f":"SUM($C59:D59)","v":0},{"$f":"SUM($C59:E59)","v":0},{"$f":"SUM($C59:F59)","v":0},{"$f":"SUM($C59:G59)","v":0},{"$f":"SUM($C59:H59)","v":0},{"$f":"SUM($C59:I59)","v":0},{"$f":"SUM($C59:J59)","v":0},{"$f":"SUM($C59:K59)","v":0},{"$f":"SUM($C59:L59)","v":0},{"$f":"SUM($C59:M59)","v":0},{"$f":"SUM($C59:N59)","v":0},{"$f":"SUM($C59:O59)","v":0},{"$f":"SUM($C59:P59)","v":0},{"$f":"SUM($C59:Q59)","v":0},{"$f":"SUM($C59:R59)","v":0},{"$f":"SUM($C59:S59)","v":0}]
[null,{"$f":"'Week 1'!A67","v":"<Enter Participant 57>"},0,0,0,0,0,0,0,0,0,0,0,0,0,0,0,0,0,{"$f":"SUM($C60:C60)","v":0},{"$f":"SUM($C60:D60)","v":0},{"$f":"SUM($C60:E60)","v":0},{"$f":"SUM($C60:F60)","v":0},{"$f":"SUM($C60:G60)","v":0},{"$f":"SUM($C60:H60)","v":0},{"$f":"SUM($C60:I60)","v":0},{"$f":"SUM($C60:J60)","v":0},{"$f":"SUM($C60:K60)","v":0},{"$f":"SUM($C60:L60)","v":0},{"$f":"SUM($C60:M60)","v":0},{"$f":"SUM($C60:N60)","v":0},{"$f":"SUM($C60:O60)","v":0},{"$f":"SUM($C60:P60)","v":0},{"$f":"SUM($C60:Q60)","v":0},{"$f":"SUM($C60:R60)","v":0},{"$f":"SUM($C60:S60)","v":0}]
[null,{"$f":"'Week 1'!A68","v":"<Enter Participant 58>"},0,0,0,0,0,0,0,0,0,0,0,0,0,0,0,0,0,{"$f":"SUM($C61:C61)","v":0},{"$f":"SUM($C61:D61)","v":0},{"$f":"SUM($C61:E61)","v":0},{"$f":"SUM($C61:F61)","v":0},{"$f":"SUM($C61:G61)","v":0},{"$f":"SUM($C61:H61)","v":0},{"$f":"SUM($C61:I61)","v":0},{"$f":"SUM($C61:J61)","v":0},{"$f":"SUM($C61:K61)","v":0},{"$f":"SUM($C61:L61)","v":0},{"$f":"SUM($C61:M61)","v":0},{"$f":"SUM($C61:N61)","v":0},{"$f":"SUM($C61:O61)","v":0},{"$f":"SUM($C61:P61)","v":0},{"$f":"SUM($C61:Q61)","v":0},{"$f":"SUM($C61:R61)","v":0},{"$f":"SUM($C61:S61)","v":0}]
[null,{"$f":"'Week 1'!A69","v":"<Enter Participant 59>"},0,0,0,0,0,0,0,0,0,0,0,0,0,0,0,0,0,{"$f":"SUM($C62:C62)","v":0},{"$f":"SUM($C62:D62)","v":0},{"$f":"SUM($C62:E62)","v":0},{"$f":"SUM($C62:F62)","v":0},{"$f":"SUM($C62:G62)","v":0},{"$f":"SUM($C62:H62)","v":0},{"$f":"SUM($C62:I62)","v":0},{"$f":"SUM($C62:J62)","v":0},{"$f":"SUM($C62:K62)","v":0},{"$f":"SUM($C62:L62)","v":0},{"$f":"SUM($C62:M62)","v":0},{"$f":"SUM($C62:N62)","v":0},{"$f":"SUM($C62:O62)","v":0},{"$f":"SUM($C62:P62)","v":0},{"$f":"SUM($C62:Q62)","v":0},{"$f":"SUM($C62:R62)","v":0},{"$f":"SUM($C62:S62)","v":0}]
[null,{"$f":"'Week 1'!A70","v":"<Enter Participant 60>"},0,0,0,0,0,0,0,0,0,0,0,0,0,0,0,0,0,{"$f":"SUM($C63:C63)","v":0},{"$f":"SUM($C63:D63)","v":0},{"$f":"SUM($C63:E63)","v":0},{"$f":"SUM($C63:F63)","v":0},{"$f":"SUM($C63:G63)","v":0},{"$f":"SUM($C63:H63)","v":0},{"$f":"SUM($C63:I63)","v":0},{"$f":"SUM($C63:J63)","v":0},{"$f":"SUM($C63:K63)","v":0},{"$f":"SUM($C63:L63)","v":0},{"$f":"SUM($C63:M63)","v":0},{"$f":"SUM($C63:N63)","v":0},{"$f":"SUM($C63:O63)","v":0},{"$f":"SUM($C63:P63)","v":0},{"$f":"SUM($C63:Q63)","v":0},{"$f":"SUM($C63:R63)","v":0},{"$f":"SUM($C63:S63)","v":0}]
[null,{"$f":"'Week 1'!A71","v":"<Enter Participant 61>"},0,0,0,0,0,0,0,0,0,0,0,0,0,0,0,0,0,{"$f":"SUM($C64:C64)","v":0},{"$f":"SUM($C64:D64)","v":0},{"$f":"SUM($C64:E64)","v":0},{"$f":"SUM($C64:F64)","v":0},{"$f":"SUM($C64:G64)","v":0},{"$f":"SUM($C64:H64)","v":0},{"$f":"SUM($C64:I64)","v":0},{"$f":"SUM($C64:J64)","v":0},{"$f":"SUM($C64:K64)","v":0},{"$f":"SUM($C64:L64)","v":0},{"$f":"SUM($C64:M64)","v":0},{"$f":"SUM($C64:N64)","v":0},{"$f":"SUM($C64:O64)","v":0},{"$f":"SUM($C64:P64)","v":0},{"$f":"SUM($C64:Q64)","v":0},{"$f":"SUM($C64:R64)","v":0},{"$f":"SUM($C64:S64)","v":0}]
[null,{"$f":"'Week 1'!A72","v":"<Enter Participant 62>"},0,0,0,0,0,0,0,0,0,0,0,0,0,0,0,0,0,{"$f":"SUM($C65:C65)","v":0},{"$f":"SUM($C65:D65)","v":0},{"$f":"SUM($C65:E65)","v":0},{"$f":"SUM($C65:F65)","v":0},{"$f":"SUM($C65:G65)","v":0},{"$f":"SUM($C65:H65)","v":0},{"$f":"SUM($C65:I65)","v":0},{"$f":"SUM($C65:J65)","v":0},{"$f":"SUM($C65:K65)","v":0},{"$f":"SUM($C65:L65)","v":0},{"$f":"SUM($C65:M65)","v":0},{"$f":"SUM($C65:N65)","v":0},{"$f":"SUM($C65:O65)","v":0},{"$f":"SUM($C65:P65)","v":0},{"$f":"SUM($C65:Q65)","v":0},{"$f":"SUM($C65:R65)","v":0},{"$f":"SUM($C65:S65)","v":0}]
[null,{"$f":"'Week 1'!A73","v":"<Enter Participant 63>"},0,0,0,0,0,0,0,0,0,0,0,0,0,0,0,0,0,{"$f":"SUM($C66:C66)","v":0},{"$f":"SUM($C66:D66)","v":0},{"$f":"SUM($C66:E66)","v":0},{"$f":"SUM($C66:F66)","v":0},{"$f":"SUM($C66:G66)","v":0},{"$f":"SUM($C66:H66)","v":0},{"$f":"SUM($C66:I66)","v":0},{"$f":"SUM($C66:J66)","v":0},{"$f":"SUM($C66:K66)","v":0},{"$f":"SUM($C66:L66)","v":0},{"$f":"SUM($C66:M66)","v":0},{"$f":"SUM($C66:N66)","v":0},{"$f":"SUM($C66:O66)","v":0},{"$f":"SUM($C66:P66)","v":0},{"$f":"SUM($C66:Q66)","v":0},{"$f":"SUM($C66:R66)","v":0},{"$f":"SUM($C66:S66)","v":0}]
[null,{"$f":"'Week 1'!A74","v":"<Enter Participant 64>"},0,0,0,0,0,0,0,0,0,0,0,0,0,0,0,0,0,{"$f":"SUM($C67:C67)","v":0},{"$f":"SUM($C67:D67)","v":0},{"$f":"SUM($C67:E67)","v":0},{"$f":"SUM($C67:F67)","v":0},{"$f":"SUM($C67:G67)","v":0},{"$f":"SUM($C67:H67)","v":0},{"$f":"SUM($C67:I67)","v":0},{"$f":"SUM($C67:J67)","v":0},{"$f":"SUM($C67:K67)","v":0},{"$f":"SUM($C67:L67)","v":0},{"$f":"SUM($C67:M67)","v":0},{"$f":"SUM($C67:N67)","v":0},{"$f":"SUM($C67:O67)","v":0},{"$f":"SUM($C67:P67)","v":0},{"$f":"SUM($C67:Q67)","v":0},{"$f":"SUM($C67:R67)","v":0},{"$f":"SUM($C67:S67)","v":0}]
[null,{"$f":"'Week 1'!A75","v":"<Enter Participant 65>"},0,0,0,0,0,0,0,0,0,0,0,0,0,0,0,0,0,{"$f":"SUM($C68:C68)","v":0},{"$f":"SUM($C68:D68)","v":0},{"$f":"SUM($C68:E68)","v":0},{"$f":"SUM($C68:F68)","v":0},{"$f":"SUM($C68:G68)","v":0},{"$f":"SUM($C68:H68)","v":0},{"$f":"SUM($C68:I68)","v":0},{"$f":"SUM($C68:J68)","v":0},{"$f":"SUM($C68:K68)","v":0},{"$f":"SUM($C68:L68)","v":0},{"$f":"SUM($C68:M68)","v":0},{"$f":"SUM($C68:N68)","v":0},{"$f":"SUM($C68:O68)","v":0},{"$f":"SUM($C68:P68)","v":0},{"$f":"SUM($C68:Q68)","v":0},{"$f":"SUM($C68:R68)","v":0},{"$f":"SUM($C68:S68)","v":0}]
[null,{"$f":"'Week 1'!A76","v":"<Enter Participant 66>"},{"$f":"IF(VLOOKUP($B69,INDIRECT(\"'\"&C$3&\"'!$A$10:$T$110\"),20,FALSE)=\"\",0,VLOOKUP($B69,INDIRECT(\"'\"&C$3&\"'!$A$10:$T$110\"),20,FALSE))","v":0},0,0,0,0,0,0,0,0,0,0,0,0,0,0,0,0,{"$f":"SUM($C69:C69)","v":0},{"$f":"SUM($C69:D69)","v":0},{"$f":"SUM($C69:E69)","v":0},{"$f":"SUM($C69:F69)","v":0},{"$f":"SUM($C69:G69)","v":0},{"$f":"SUM($C69:H69)","v":0},{"$f":"SUM($C69:I69)","v":0},{"$f":"SUM($C69:J69)","v":0},{"$f":"SUM($C69:K69)","v":0},{"$f":"SUM($C69:L69)","v":0},{"$f":"SUM($C69:M69)","v":0},{"$f":"SUM($C69:N69)","v":0},{"$f":"SUM($C69:O69)","v":0},{"$f":"SUM($C69:P69)","v":0},{"$f":"SUM($C69:Q69)","v":0},{"$f":"SUM($C69:R69)","v":0},{"$f":"SUM($C69:S69)","v":0}]
[null,{"$f":"'Week 1'!A77","v":"<Enter Participant 67>"},0,0,0,0,0,0,0,0,0,0,0,0,0,0,0,0,0,{"$f":"SUM($C70:C70)","v":0},{"$f":"SUM($C70:D70)","v":0},{"$f":"SUM($C70:E70)","v":0},{"$f":"SUM($C70:F70)","v":0},{"$f":"SUM($C70:G70)","v":0},{"$f":"SUM($C70:H70)","v":0},{"$f":"SUM($C70:I70)","v":0},{"$f":"SUM($C70:J70)","v":0},{"$f":"SUM($C70:K70)","v":0},{"$f":"SUM($C70:L70)","v":0},{"$f":"SUM($C70:M70)","v":0},{"$f":"SUM($C70:N70)","v":0},{"$f":"SUM($C70:O70)","v":0},{"$f":"SUM($C70:P70)","v":0},{"$f":"SUM($C70:Q70)","v":0},{"$f":"SUM($C70:R70)","v":0},{"$f":"SUM($C70:S70)","v":0}]
[null,{"$f":"'Week 1'!A78","v":"<Enter Participant 68>"},0,0,0,0,0,0,0,0,0,0,0,0,0,0,0,0,0,{"$f":"SUM($C71:C71)","v":0},{"$f":"SUM($C71:D71)","v":0},{"$f":"SUM($C71:E71)","v":0},{"$f":"SUM($C71:F71)","v":0},{"$f":"SUM($C71:G71)","v":0},{"$f":"SUM($C71:H71)","v":0},{"$f":"SUM($C71:I71)","v":0},{"$f":"SUM($C71:J71)","v":0},{"$f":"SUM($C71:K71)","v":0},{"$f":"SUM($C71:L71)","v":0},{"$f":"SUM($C71:M71)","v":0},{"$f":"SUM($C71:N71)","v":0},{"$f":"SUM($C71:O71)","v":0},{"$f":"SUM($C71:P71)","v":0},{"$f":"SUM($C71:Q71)","v":0},{"$f":"SUM($C71:R71)","v":0},{"$f":"SUM($C71:S71)","v":0}]
[null,{"$f":"'Week 1'!A79","v":"<Enter Participant 69>"},0,0,0,0,0,0,0,0,0,0,0,0,0,0,0,0,0,{"$f":"SUM($C72:C72)","v":0},{"$f":"SUM($C72:D72)","v":0},{"$f":"SUM($C72:E72)","v":0},{"$f":"SUM($C72:F72)","v":0},{"$f":"SUM($C72:G72)","v":0},{"$f":"SUM($C72:H72)","v":0},{"$f":"SUM($C72:I72)","v":0},{"$f":"SUM($C72:J72)","v":0},{"$f":"SUM($C72:K72)","v":0},{"$f":"SUM($C72:L72)","v":0},{"$f":"SUM($C72:M72)","v":0},{"$f":"SUM($C72:N72)","v":0},{"$f":"SUM($C72:O72)","v":0},{"$f":"SUM($C72:P72)","v":0},{"$f":"SUM($C72:Q72)","v":0},{"$f":"SUM($C72:R72)","v":0},{"$f":"SUM($C72:S72)","v":0}]
[null,{"$f":"'Week 1'!A80","v":"<Enter Participant 70>"},0,0,0,0,0,0,0,0,0,0,0,0,0,0,0,0,0,{"$f":"SUM($C73:C73)","v":0},{"$f":"SUM($C73:D73)","v":0},{"$f":"SUM($C73:E73)","v":0},{"$f":"SUM($C73:F73)","v":0},{"$f":"SUM($C73:G73)","v":0},{"$f":"SUM($C73:H73)","v":0},{"$f":"SUM($C73:I73)","v":0},{"$f":"SUM($C73:J73)","v":0},{"$f":"SUM($C73:K73)","v":0},{"$f":"SUM($C73:L73)","v":0},{"$f":"SUM($C73:M73)","v":0},{"$f":"SUM($C73:N73)","v":0},{"$f":"SUM($C73:O73)","v":0},{"$f":"SUM($C73:P73)","v":0},{"$f":"SUM($C73:Q73)","v":0},{"$f":"SUM($C73:R73)","v":0},{"$f":"SUM($C73:S73)","v":0}]
[null,{"$f":"'Week 1'!A81","v":"<Enter Participant 71>"},0,0,0,0,0,0,0,0,0,0,0,0,0,0,0,0,0,{"$f":"SUM($C74:C74)","v":0},{"$f":"SUM($C74:D74)","v":0},{"$f":"SUM($C74:E74)","v":0},{"$f":"SUM($C74:F74)","v":0},{"$f":"SUM($C74:G74)","v":0},{"$f":"SUM($C74:H74)","v":0},{"$f":"SUM($C74:I74)","v":0},{"$f":"SUM($C74:J74)","v":0},{"$f":"SUM($C74:K74)","v":0},{"$f":"SUM($C74:L74)","v":0},{"$f":"SUM($C74:M74)","v":0},{"$f":"SUM($C74:N74)","v":0},{"$f":"SUM($C74:O74)","v":0},{"$f":"SUM($C74:P74)","v":0},{"$f":"SUM($C74:Q74)","v":0},{"$f":"SUM($C74:R74)","v":0},{"$f":"SUM($C74:S74)","v":0}]
[null,{"$f":"'Week 1'!A82","v":"<Enter Participant 72>"},0,0,0,0,0,0,0,0,0,0,0,0,0,0,0,0,0,{"$f":"SUM($C75:C75)","v":0},{"$f":"SUM($C75:D75)","v":0},{"$f":"SUM($C75:E75)","v":0},{"$f":"SUM($C75:F75)","v":0},{"$f":"SUM($C75:G75)","v":0},{"$f":"SUM($C75:H75)","v":0},{"$f":"SUM($C75:I75)","v":0},{"$f":"SUM($C75:J75)","v":0},{"$f":"SUM($C75:K75)","v":0},{"$f":"SUM($C75:L75)","v":0},{"$f":"SUM($C75:M75)","v":0},{"$f":"SUM($C75:N75)","v":0},{"$f":"SUM($C75:O75)","v":0},{"$f":"SUM($C75:P75)","v":0},{"$f":"SUM($C75:Q75)","v":0},{"$f":"SUM($C75:R75)","v":0},{"$f":"SUM($C75:S75)","v":0}]
[null,{"$f":"'Week 1'!A83","v":"<Enter Participant 73>"},0,0,0,0,0,0,0,0,0,0,0,0,0,0,0,0,0,{"$f":"SUM($C76:C76)","v":0},{"$f":"SUM($C76:D76)","v":0},{"$f":"SUM($C76:E76)","v":0},{"$f":"SUM($C76:F76)","v":0},{"$f":"SUM($C76:G76)","v":0},{"$f":"SUM($C76:H76)","v":0},{"$f":"SUM($C76:I76)","v":0},{"$f":"SUM($C76:J76)","v":0},{"$f":"SUM($C76:K76)","v":0},{"$f":"SUM($C76:L76)","v":0},{"$f":"SUM($C76:M76)","v":0},{"$f":"SUM($C76:N76)","v":0},{"$f":"SUM($C76:O76)","v":0},{"$f":"SUM($C76:P76)","v":0},{"$f":"SUM($C76:Q76)","v":0},{"$f":"SUM($C76:R76)","v":0},{"$f":"SUM($C76:S76)","v":0}]
[null,{"$f":"'Week 1'!A84","v":"<Enter Participant 74>"},0,0,0,0,0,0,0,0,0,0,0,0,0,0,0,0,0,{"$f":"SUM($C77:C77)","v":0},{"$f":"SUM($C77:D77)","v":0},{"$f":"SUM($C77:E77)","v":0},{"$f":"SUM($C77:F77)","v":0},{"$f":"SUM($C77:G77)","v":0},{"$f":"SUM($C77:H77)","v":0},{"$f":"SUM($C77:I77)","v":0},{"$f":"SUM($C77:J77)","v":0},{"$f":"SUM($C77:K77)","v":0},{"$f":"SUM($C77:L77)","v":0},{"$f":"SUM($C77:M77)","v":0},{"$f":"SUM($C77:N77)","v":0},{"$f":"SUM($C77:O77)","v":0},{"$f":"SUM($C77:P77)","v":0},{"$f":"SUM($C77:Q77)","v":0},{"$f":"SUM($C77:R77)","v":0},{"$f":"SUM($C77:S77)","v":0}]
[null,{"$f":"'Week 1'!A85","v":"<Enter Participant 75>"},0,0,0,0,0,0,0,0,0,0,0,0,0,0,0,0,0,{"$f":"SUM($C78:C78)","v":0},{"$f":"SUM($C78:D78)","v":0},{"$f":"SUM($C78:E78)","v":0},{"$f":"SUM($C78:F78)","v":0},{"$f":"SUM($C78:G78)","v":0},{"$f":"SUM($C78:H78)","v":0},{"$f":"SUM($C78:I78)","v":0},{"$f":"SUM($C78:J78)","v":0},{"$f":"SUM($C78:K78)","v":0},{"$f":"SUM($C78:L78)","v":0},{"$f":"SUM($C78:M78)","v":0},{"$f":"SUM($C78:N78)","v":0},{"$f":"SUM($C78:O78)","v":0},{"$f":"SUM($C78:P78)","v":0},{"$f":"SUM($C78:Q78)","v":0},{"$f":"SUM($C78:R78)","v":0},{"$f":"SUM($C78:S78)","v":0}]
[null,"<Enter Participant 76>",0,0,0,0,0,0,0,0,0,0,0,0,0,0,0,0,0,{"$f":"SUM($C79:C79)","v":0},{"$f":"SUM($C79:D79)","v":0},{"$f":"SUM($C79:E79)","v":0},{"$f":"SUM($C79:F79)","v":0},{"$f":"SUM($C79:G79)","v":0},{"$f":"SUM($C79:H79)","v":0},{"$f":"SUM($C79:I79)","v":0},{"$f":"SUM($C79:J79)","v":0},{"$f":"SUM($C79:K79)","v":0},{"$f":"SUM($C79:L79)","v":0},{"$f":"SUM($C79:M79)","v":0},{"$f":"SUM($C79:N79)","v":0},{"$f":"SUM($C79:O79)","v":0},{"$f":"SUM($C79:P79)","v":0},{"$f":"SUM($C79:Q79)","v":0},{"$f":"SUM($C79:R79)","v":0},{"$f":"SUM($C79:S79)","v":0}]
[null,"<Enter Participant 77>",0,0,0,0,0,0,0,0,0,0,0,0,0,0,0,0,0,{"$f":"SUM($C80:C80)","v":0},{"$f":"SUM($C80:D80)","v":0},{"$f":"SUM($C80:E80)","v":0},{"$f":"SUM($C80:F80)","v":0},{"$f":"SUM($C80:G80)","v":0},{"$f":"SUM($C80:H80)","v":0},{"$f":"SUM($C80:I80)","v":0},{"$f":"SUM($C80:J80)","v":0},{"$f":"SUM($C80:K80)","v":0},{"$f":"SUM($C80:L80)","v":0},{"$f":"SUM($C80:M80)","v":0},{"$f":"SUM($C80:N80)","v":0},{"$f":"SUM($C80:O80)","v":0},{"$f":"SUM($C80:P80)","v":0},{"$f":"SUM($C80:Q80)","v":0},{"$f":"SUM($C80:R80)","v":0},{"$f":"SUM($C80:S80)","v":0}]
[null,"<Enter Participant 78>",0,0,0,0,0,0,0,0,0,0,0,0,0,0,0,0,0,{"$f":"SUM($C81:C81)","v":0},{"$f":"SUM($C81:D81)","v":0},{"$f":"SUM($C81:E81)","v":0},{"$f":"SUM($C81:F81)","v":0},{"$f":"SUM($C81:G81)","v":0},{"$f":"SUM($C81:H81)","v":0},{"$f":"SUM($C81:I81)","v":0},{"$f":"SUM($C81:J81)","v":0},{"$f":"SUM($C81:K81)","v":0},{"$f":"SUM($C81:L81)","v":0},{"$f":"SUM($C81:M81)","v":0},{"$f":"SUM($C81:N81)","v":0},{"$f":"SUM($C81:O81)","v":0},{"$f":"SUM($C81:P81)","v":0},{"$f":"SUM($C81:Q81)","v":0},{"$f":"SUM($C81:R81)","v":0},{"$f":"SUM($C81:S81)","v":0}]
[null,"<Enter Participant 79>",0,0,0,0,0,0,0,0,0,0,0,0,0,0,0,0,0,{"$f":"SUM($C82:C82)","v":0},{"$f":"SUM($C82:D82)","v":0},{"$f":"SUM($C82:E82)","v":0},{"$f":"SUM($C82:F82)","v":0},{"$f":"SUM($C82:G82)","v":0},{"$f":"SUM($C82:H82)","v":0},{"$f":"SUM($C82:I82)","v":0},{"$f":"SUM($C82:J82)","v":0},{"$f":"SUM($C82:K82)","v":0},{"$f":"SUM($C82:L82)","v":0},{"$f":"SUM($C82:M82)","v":0},{"$f":"SUM($C82:N82)","v":0},{"$f":"SUM($C82:O82)","v":0},{"$f":"SUM($C82:P82)","v":0},{"$f":"SUM($C82:Q82)","v":0},{"$f":"SUM($C82:R82)","v":0},{"$f":"SUM($C82:S82)","v":0}]
[null,"<Enter Participant 80>",0,0,0,0,0,0,0,0,0,0,0,0,0,0,0,0,{"$f":"IF(VLOOKUP($B83,INDIRECT(\"'\"&S$3&\"'!$A$10:$T$110\"),20,FALSE)=\"\",0,VLOOKUP($B83,INDIRECT(\"'\"&S$3&\"'!$A$10:$T$110\"),20,FALSE))","v":0},{"$f":"SUM($C83:C83)","v":0},{"$f":"SUM($C83:D83)","v":0},{"$f":"SUM($C83:E83)","v":0},{"$f":"SUM($C83:F83)","v":0},{"$f":"SUM($C83:G83)","v":0},{"$f":"SUM($C83:H83)","v":0},{"$f":"SUM($C83:I83)","v":0},{"$f":"SUM($C83:J83)","v":0},{"$f":"SUM($C83:K83)","v":0},{"$f":"SUM($C83:L83)","v":0},{"$f":"SUM($C83:M83)","v":0},{"$f":"SUM($C83:N83)","v":0},{"$f":"SUM($C83:O83)","v":0},{"$f":"SUM($C83:P83)","v":0},{"$f":"SUM($C83:Q83)","v":0},{"$f":"SUM($C83:R83)","v":0},{"$f":"SUM($C83:S83)","v":0}]
[null,"<Enter Participant 81>",0,0,0,0,0,0,0,0,0,0,0,0,0,0,0,{"$f":"IF(VLOOKUP($B84,INDIRECT(\"'\"&R$3&\"'!$A$10:$T$110\"),20,FALSE)=\"\",0,VLOOKUP($B84,INDIRECT(\"'\"&R$3&\"'!$A$10:$T$110\"),20,FALSE))","v":0},0,{"$f":"SUM($C84:C84)","v":0},{"$f":"SUM($C84:D84)","v":0},{"$f":"SUM($C84:E84)","v":0},{"$f":"SUM($C84:F84)","v":0},{"$f":"SUM($C84:G84)","v":0},{"$f":"SUM($C84:H84)","v":0},{"$f":"SUM($C84:I84)","v":0},{"$f":"SUM($C84:J84)","v":0},{"$f":"SUM($C84:K84)","v":0},{"$f":"SUM($C84:L84)","v":0},{"$f":"SUM($C84:M84)","v":0},{"$f":"SUM($C84:N84)","v":0},{"$f":"SUM($C84:O84)","v":0},{"$f":"SUM($C84:P84)","v":0},{"$f":"SUM($C84:Q84)","v":0},{"$f":"SUM($C84:R84)","v":0},{"$f":"SUM($C84:S84)","v":0}]
[null,"<Enter Participant 82>",{"$f":"IF(VLOOKUP($B85,INDIRECT(\"'\"&C$3&\"'!$A$10:$T$110\"),20,FALSE)=\"\",0,VLOOKUP($B85,INDIRECT(\"'\"&C$3&\"'!$A$10:$T$110\"),20,FALSE))","v":0},0,0,0,0,0,0,0,0,0,0,0,0,0,0,0,0,{"$f":"SUM($C85:C85)","v":0},{"$f":"SUM($C85:D85)","v":0},{"$f":"SUM($C85:E85)","v":0},{"$f":"SUM($C85:F85)","v":0},{"$f":"SUM($C85:G85)","v":0},{"$f":"SUM($C85:H85)","v":0},{"$f":"SUM($C85:I85)","v":0},{"$f":"SUM($C85:J85)","v":0},{"$f":"SUM($C85:K85)","v":0},{"$f":"SUM($C85:L85)","v":0},{"$f":"SUM($C85:M85)","v":0},{"$f":"SUM($C85:N85)","v":0},{"$f":"SUM($C85:O85)","v":0},{"$f":"SUM($C85:P85)","v":0},{"$f":"SUM($C85:Q85)","v":0},{"$f":"SUM($C85:R85)","v":0},{"$f":"SUM($C85:S85)","v":0}]
[null,"<Enter Participant 83>",0,0,0,0,0,0,0,0,0,0,0,0,0,0,0,0,0,{"$f":"SUM($C86:C86)","v":0},{"$f":"SUM($C86:D86)","v":0},{"$f":"SUM($C86:E86)","v":0},{"$f":"SUM($C86:F86)","v":0},{"$f":"SUM($C86:G86)","v":0},{"$f":"SUM($C86:H86)","v":0},{"$f":"SUM($C86:I86)","v":0},{"$f":"SUM($C86:J86)","v":0},{"$f":"SUM($C86:K86)","v":0},{"$f":"SUM($C86:L86)","v":0},{"$f":"SUM($C86:M86)","v":0},{"$f":"SUM($C86:N86)","v":0},{"$f":"SUM($C86:O86)","v":0},{"$f":"SUM($C86:P86)","v":0},{"$f":"SUM($C86:Q86)","v":0},{"$f":"SUM($C86:R86)","v":0},{"$f":"SUM($C86:S86)","v":0}]
[null,"<Enter Participant 84>",0,0,0,0,0,0,0,0,0,0,0,0,0,0,0,0,0,{"$f":"SUM($C87:C87)","v":0},{"$f":"SUM($C87:D87)","v":0},{"$f":"SUM($C87:E87)","v":0},{"$f":"SUM($C87:F87)","v":0},{"$f":"SUM($C87:G87)","v":0},{"$f":"SUM($C87:H87)","v":0},{"$f":"SUM($C87:I87)","v":0},{"$f":"SUM($C87:J87)","v":0},{"$f":"SUM($C87:K87)","v":0},{"$f":"SUM($C87:L87)","v":0},{"$f":"SUM($C87:M87)","v":0},{"$f":"SUM($C87:N87)","v":0},{"$f":"SUM($C87:O87)","v":0},{"$f":"SUM($C87:P87)","v":0},{"$f":"SUM($C87:Q87)","v":0},{"$f":"SUM($C87:R87)","v":0},{"$f":"SUM($C87:S87)","v":0}]
[null,"<Enter Participant 85>",0,0,0,0,0,0,0,0,0,0,0,0,0,0,0,0,0,{"$f":"SUM($C88:C88)","v":0},{"$f":"SUM($C88:D88)","v":0},{"$f":"SUM($C88:E88)","v":0},{"$f":"SUM($C88:F88)","v":0},{"$f":"SUM($C88:G88)","v":0},{"$f":"SUM($C88:H88)","v":0},{"$f":"SUM($C88:I88)","v":0},{"$f":"SUM($C88:J88)","v":0},{"$f":"SUM($C88:K88)","v":0},{"$f":"SUM($C88:L88)","v":0},{"$f":"SUM($C88:M88)","v":0},{"$f":"SUM($C88:N88)","v":0},{"$f":"SUM($C88:O88)","v":0},{"$f":"SUM($C88:P88)","v":0},{"$f":"SUM($C88:Q88)","v":0},{"$f":"SUM($C88:R88)","v":0},{"$f":"SUM($C88:S88)","v":0}]
[null,"<Enter Participant 86>",0,0,0,0,0,0,0,0,0,0,0,0,0,0,0,0,0,{"$f":"SUM($C89:C89)","v":0},{"$f":"SUM($C89:D89)","v":0},{"$f":"SUM($C89:E89)","v":0},{"$f":"SUM($C89:F89)","v":0},{"$f":"SUM($C89:G89)","v":0},{"$f":"SUM($C89:H89)","v":0},{"$f":"SUM($C89:I89)","v":0},{"$f":"SUM($C89:J89)","v":0},{"$f":"SUM($C89:K89)","v":0},{"$f":"SUM($C89:L89)","v":0},{"$f":"SUM($C89:M89)","v":0},{"$f":"SUM($C89:N89)","v":0},{"$f":"SUM($C89:O89)","v":0},{"$f":"SUM($C89:P89)","v":0},{"$f":"SUM($C89:Q89)","v":0},{"$f":"SUM($C89:R89)","v":0},{"$f":"SUM($C89:S89)","v":0}]
[null,"<Enter Participant 87>",0,0,0,0,0,0,0,0,0,0,0,0,0,0,0,0,0,{"$f":"SUM($C90:C90)","v":0},{"$f":"SUM($C90:D90)","v":0},{"$f":"SUM($C90:E90)","v":0},{"$f":"SUM($C90:F90)","v":0},{"$f":"SUM($C90:G90)","v":0},{"$f":"SUM($C90:H90)","v":0},{"$f":"SUM($C90:I90)","v":0},{"$f":"SUM($C90:J90)","v":0},{"$f":"SUM($C90:K90)","v":0},{"$f":"SUM($C90:L90)","v":0},{"$f":"SUM($C90:M90)","v":0},{"$f":"SUM($C90:N90)","v":0},{"$f":"SUM($C90:O90)","v":0},{"$f":"SUM($C90:P90)","v":0},{"$f":"SUM($C90:Q90)","v":0},{"$f":"SUM($C90:R90)","v":0},{"$f":"SUM($C90:S90)","v":0}]
[null,"<Enter Participant 88>",0,0,0,0,0,0,0,0,0,0,0,0,0,0,0,0,0,{"$f":"SUM($C91:C91)","v":0},{"$f":"SUM($C91:D91)","v":0},{"$f":"SUM($C91:E91)","v":0},{"$f":"SUM($C91:F91)","v":0},{"$f":"SUM($C91:G91)","v":0},{"$f":"SUM($C91:H91)","v":0},{"$f":"SUM($C91:I91)","v":0},{"$f":"SUM($C91:J91)","v":0},{"$f":"SUM($C91:K91)","v":0},{"$f":"SUM($C91:L91)","v":0},{"$f":"SUM($C91:M91)","v":0},{"$f":"SUM($C91:N91)","v":0},{"$f":"SUM($C91:O91)","v":0},{"$f":"SUM($C91:P91)","v":0},{"$f":"SUM($C91:Q91)","v":0},{"$f":"SUM($C91:R91)","v":0},{"$f":"SUM($C91:S91)","v":0}]
[null,"<Enter Participant 89>",0,0,0,0,0,0,0,0,0,0,0,0,0,0,0,0,0,{"$f":"SUM($C92:C92)","v":0},{"$f":"SUM($C92:D92)","v":0},{"$f":"SUM($C92:E92)","v":0},{"$f":"SUM($C92:F92)","v":0},{"$f":"SUM($C92:G92)","v":0},{"$f":"SUM($C92:H92)","v":0},{"$f":"SUM($C92:I92)","v":0},{"$f":"SUM($C92:J92)","v":0},{"$f":"SUM($C92:K92)","v":0},{"$f":"SUM($C92:L92)","v":0},{"$f":"SUM($C92:M92)","v":0},{"$f":"SUM($C92:N92)","v":0},{"$f":"SUM($C92:O92)","v":0},{"$f":"SUM($C92:P92)","v":0},{"$f":"SUM($C92:Q92)","v":0},{"$f":"SUM($C92:R92)","v":0},{"$f":"SUM($C92:S92)","v":0}]
[null,"<Enter Participant 90>",0,0,0,0,0,0,0,0,0,0,0,0,0,0,0,0,0,{"$f":"SUM($C93:C93)","v":0},{"$f":"SUM($C93:D93)","v":0},{"$f":"SUM($C93:E93)","v":0},{"$f":"SUM($C93:F93)","v":0},{"$f":"SUM($C93:G93)","v":0},{"$f":"SUM($C93:H93)","v":0},{"$f":"SUM($C93:I93)","v":0},{"$f":"SUM($C93:J93)","v":0},{"$f":"SUM($C93:K93)","v":0},{"$f":"SUM($C93:L93)","v":0},{"$f":"SUM($C93:M93)","v":0},{"$f":"SUM($C93:N93)","v":0},{"$f":"SUM($C93:O93)","v":0},{"$f":"SUM($C93:P93)","v":0},{"$f":"SUM($C93:Q93)","v":0},{"$f":"SUM($C93:R93)","v":0},{"$f":"SUM($C93:S93)","v":0}]
[null,"<Enter Participant 91>",0,0,0,0,0,0,0,0,0,0,0,0,0,0,0,0,0,{"$f":"SUM($C94:C94)","v":0},{"$f":"SUM($C94:D94)","v":0},{"$f":"SUM($C94:E94)","v":0},{"$f":"SUM($C94:F94)","v":0},{"$f":"SUM($C94:G94)","v":0},{"$f":"SUM($C94:H94)","v":0},{"$f":"SUM($C94:I94)","v":0},{"$f":"SUM($C94:J94)","v":0},{"$f":"SUM($C94:K94)","v":0},{"$f":"SUM($C94:L94)","v":0},{"$f":"SUM($C94:M94)","v":0},{"$f":"SUM($C94:N94)","v":0},{"$f":"SUM($C94:O94)","v":0},{"$f":"SUM($C94:P94)","v":0},{"$f":"SUM($C94:Q94)","v":0},{"$f":"SUM($C94:R94)","v":0},{"$f":"SUM($C94:S94)","v":0}]
[null,"<Enter Participant 92>",0,0,0,0,0,0,0,0,0,0,0,0,0,0,0,0,0,{"$f":"SUM($C95:C95)","v":0},{"$f":"SUM($C95:D95)","v":0},{"$f":"SUM($C95:E95)","v":0},{"$f":"SUM($C95:F95)","v":0},{"$f":"SUM($C95:G95)","v":0},{"$f":"SUM($C95:H95)","v":0},{"$f":"SUM($C95:I95)","v":0},{"$f":"SUM($C95:J95)","v":0},{"$f":"SUM($C95:K95)","v":0},{"$f":"SUM($C95:L95)","v":0},{"$f":"SUM($C95:M95)","v":0},{"$f":"SUM($C95:N95)","v":0},{"$f":"SUM($C95:O95)","v":0},{"$f":"SUM($C95:P95)","v":0},{"$f":"SUM($C95:Q95)","v":0},{"$f":"SUM($C95:R95)","v":0},{"$f":"SUM($C95:S95)","v":0}]
[null,"<Enter Participant 93>",0,0,0,0,0,0,0,0,0,0,0,0,0,0,0,0,0,{"$f":"SUM($C96:C96)","v":0},{"$f":"SUM($C96:D96)","v":0},{"$f":"SUM($C96:E96)","v":0},{"$f":"SUM($C96:F96)","v":0},{"$f":"SUM($C96:G96)","v":0},{"$f":"SUM($C96:H96)","v":0},{"$f":"SUM($C96:I96)","v":0},{"$f":"SUM($C96:J96)","v":0},{"$f":"SUM($C96:K96)","v":0},{"$f":"SUM($C96:L96)","v":0},{"$f":"SUM($C96:M96)","v":0},{"$f":"SUM($C96:N96)","v":0},{"$f":"SUM($C96:O96)","v":0},{"$f":"SUM($C96:P96)","v":0},{"$f":"SUM($C96:Q96)","v":0},{"$f":"SUM($C96:R96)","v":0},{"$f":"SUM($C96:S96)","v":0}]
[null,"<Enter Participant 94>",0,0,0,0,0,0,0,0,0,0,0,0,0,0,0,0,0,{"$f":"SUM($C97:C97)","v":0},{"$f":"SUM($C97:D97)","v":0},{"$f":"SUM($C97:E97)","v":0},{"$f":"SUM($C97:F97)","v":0},{"$f":"SUM($C97:G97)","v":0},{"$f":"SUM($C97:H97)","v":0},{"$f":"SUM($C97:I97)","v":0},{"$f":"SUM($C97:J97)","v":0},{"$f":"SUM($C97:K97)","v":0},{"$f":"SUM($C97:L97)","v":0},{"$f":"SUM($C97:M97)","v":0},{"$f":"SUM($C97:N97)","v":0},{"$f":"SUM($C97:O97)","v":0},{"$f":"SUM($C97:P97)","v":0},{"$f":"SUM($C97:Q97)","v":0},{"$f":"SUM($C97:R97)","v":0},{"$f":"SUM($C97:S97)","v":0}]
[null,"<Enter Participant 95>",0,0,0,0,0,0,0,0,0,0,0,0,0,0,0,0,0,{"$f":"SUM($C98:C98)","v":0},{"$f":"SUM($C98:D98)","v":0},{"$f":"SUM($C98:E98)","v":0},{"$f":"SUM($C98:F98)","v":0},{"$f":"SUM($C98:G98)","v":0},{"$f":"SUM($C98:H98)","v":0},{"$f":"SUM($C98:I98)","v":0},{"$f":"SUM($C98:J98)","v":0},{"$f":"SUM($C98:K98)","v":0},{"$f":"SUM($C98:L98)","v":0},{"$f":"SUM($C98:M98)","v":0},{"$f":"SUM($C98:N98)","v":0},{"$f":"SUM($C98:O98)","v":0},{"$f":"SUM($C98:P98)","v":0},{"$f":"SUM($C98:Q98)","v":0},{"$f":"SUM($C98:R98)","v":0},{"$f":"SUM($C98:S98)","v":0}]
[null,"<Enter Participant 96>",0,0,0,0,0,0,0,0,0,0,0,0,0,0,0,0,0,{"$f":"SUM($C99:C99)","v":0},{"$f":"SUM($C99:D99)","v":0},{"$f":"SUM($C99:E99)","v":0},{"$f":"SUM($C99:F99)","v":0},{"$f":"SUM($C99:G99)","v":0},{"$f":"SUM($C99:H99)","v":0},{"$f":"SUM($C99:I99)","v":0},{"$f":"SUM($C99:J99)","v":0},{"$f":"SUM($C99:K99)","v":0},{"$f":"SUM($C99:L99)","v":0},{"$f":"SUM($C99:M99)","v":0},{"$f":"SUM($C99:N99)","v":0},{"$f":"SUM($C99:O99)","v":0},{"$f":"SUM($C99:P99)","v":0},{"$f":"SUM($C99:Q99)","v":0},{"$f":"SUM($C99:R99)","v":0},{"$f":"SUM($C99:S99)","v":0}]
[null,"<Enter Participant 97>",0,0,0,0,0,0,0,0,0,0,0,0,0,0,0,0,0,{"$f":"SUM($C100:C100)","v":0},{"$f":"SUM($C100:D100)","v":0},{"$f":"SUM($C100:E100)","v":0},{"$f":"SUM($C100:F100)","v":0},{"$f":"SUM($C100:G100)","v":0},{"$f":"SUM($C100:H100)","v":0},{"$f":"SUM($C100:I100)","v":0},{"$f":"SUM($C100:J100)","v":0},{"$f":"SUM($C100:K100)","v":0},{"$f":"SUM($C100:L100)","v":0},{"$f":"SUM($C100:M100)","v":0},{"$f":"SUM($C100:N100)","v":0},{"$f":"SUM($C100:O100)","v":0},{"$f":"SUM($C100:P100)","v":0},{"$f":"SUM($C100:Q100)","v":0},{"$f":"SUM($C100:R100)","v":0},{"$f":"SUM($C100:S100)","v":0}]
[null,"<Enter Participant 98>",{"$f":"IF(VLOOKUP($B101,INDIRECT(\"'\"&C$3&\"'!$A$10:$T$110\"),20,FALSE)=\"\",0,VLOOKUP($B101,INDIRECT(\"'\"&C$3&\"'!$A$10:$T$110\"),20,FALSE))","v":0},0,0,0,0,0,0,0,0,0,0,0,0,0,0,0,0,{"$f":"SUM($C101:C101)","v":0},{"$f":"SUM($C101:D101)","v":0},{"$f":"SUM($C101:E101)","v":0},{"$f":"SUM($C101:F101)","v":0},{"$f":"SUM($C101:G101)","v":0},{"$f":"SUM($C101:H101)","v":0},{"$f":"SUM($C101:I101)","v":0},{"$f":"SUM($C101:J101)","v":0},{"$f":"SUM($C101:K101)","v":0},{"$f":"SUM($C101:L101)","v":0},{"$f":"SUM($C101:M101)","v":0},{"$f":"SUM($C101:N101)","v":0},{"$f":"SUM($C101:O101)","v":0},{"$f":"SUM($C101:P101)","v":0},{"$f":"SUM($C101:Q101)","v":0},{"$f":"SUM($C101:R101)","v":0},{"$f":"SUM($C101:S101)","v":0}]
[null,"<Enter Participant 99>",0,0,0,0,0,0,0,0,0,0,0,0,0,0,0,0,0,{"$f":"SUM($C102:C102)","v":0},{"$f":"SUM($C102:D102)","v":0},{"$f":"SUM($C102:E102)","v":0},{"$f":"SUM($C102:F102)","v":0},{"$f":"SUM($C102:G102)","v":0},{"$f":"SUM($C102:H102)","v":0},{"$f":"SUM($C102:I102)","v":0},{"$f":"SUM($C102:J102)","v":0},{"$f":"SUM($C102:K102)","v":0},{"$f":"SUM($C102:L102)","v":0},{"$f":"SUM($C102:M102)","v":0},{"$f":"SUM($C102:N102)","v":0},{"$f":"SUM($C102:O102)","v":0},{"$f":"SUM($C102:P102)","v":0},{"$f":"SUM($C102:Q102)","v":0},{"$f":"SUM($C102:R102)","v":0},{"$f":"SUM($C102:S102)","v":0}]
[null,"<Enter Participant 100>",0,0,0,0,0,0,0,0,0,0,0,0,0,0,0,0,0,{"$f":"SUM($C103:C103)","v":0},{"$f":"SUM($C103:D103)","v":0},{"$f":"SUM($C103:E103)","v":0},{"$f":"SUM($C103:F103)","v":0},{"$f":"SUM($C103:G103)","v":0},{"$f":"SUM($C103:H103)","v":0},{"$f":"SUM($C103:I103)","v":0},{"$f":"SUM($C103:J103)","v":0},{"$f":"SUM($C103:K103)","v":0},{"$f":"SUM($C103:L103)","v":0},{"$f":"SUM($C103:M103)","v":0},{"$f":"SUM($C103:N103)","v":0},{"$f":"SUM($C103:O103)","v":0},{"$f":"SUM($C103:P103)","v":0},{"$f":"SUM($C103:Q103)","v":0},{"$f":"SUM($C103:R103)","v":0},{"$f":"SUM($C103:S103)","v":0}]

{"sheet":"dev_notes","index":18,"n_rows":73,"n_cols":5,"rows_kept":73,"cut":false,"hidden":true,"merged":[]}
[]
[null,"2014-2015 Enhancements"]
[]
[null,"make it so I can easily copy-paste whole lists/tables of picks"]
[null,"allow me to delete whole ranges of picks"]
[null,"conditional color formatting of the teams would be cool"]
[null,"make a participant picks sheet where they pick the week, and the games are filled out and they can pick their picks and send them in."]
[]
[null,"Backlog"]
[]
[null,"add in support for confidence points"]
[null,"add in support for picking against the spread"]
[]
[null,"Way Backlog"]
[]
[null,"figure out what historic spreads look like from a distribution standpoint, then have confidence points based on picks with or for the spread"]
[]
[null,"Reference Lists"]
[]
[null,null,"TEAM_LIST","Font","Background"]
[null,null,"ARI","white","148, 34, 60"]
[null,null,"ATL","red","black"]
[null,null,"BAL","230, 200, 88","36, 22, 100"]
[null,null,"BUF","204, 14, 44","4, 50, 140"]
[null,null,"CAR","212, 214, 212","4, 138, 212"]
[null,null,"CHI","255, 102, 0","5, 36, 71"]
[null,null,"CIN","black","244, 78, 36"]
[null,null,"CLE","252, 82, 20","60, 34, 12"]
[null,null,"DAL","15% grey","50% dark blue"]
[null,null,"DEN","252, 78, 4","20, 55, 98"]
[null,null,"DET","188, 198, 204","4, 106, 172"]
[null,null,"GB","244, 202, 5","36, 71, 41"]
[null,null,"HOU","white","4, 26, 52"]
[null,null,"IND","white","4, 58, 108"]
[null,null,"JAX","212, 186, 84","4, 126, 132"]
[null,null,"KC","244, 198, 4","192, 0, 0"]
[null,null,"MIA","white","25, 136, 144"]
[null,null,"MIN","244, 190, 4","60, 2, 95"]
[null,null,"NE","220, 222, 220","12, 34, 68"]
[null,null,"NO","196, 174, 116","black"]
[null,null,"NYG","white","28, 46, 108"]
[null,null,"NYJ","white","28, 50, 36"]
[null,null,"OAK","196, 202, 204","black"]
[null,null,"PHI","196, 198, 196","4, 58, 68"]
[null,null,"PIT","black","252, 182, 28"]
[null,null,"SD","252, 182, 28","4, 110, 204"]
[null,null,"SEA","100, 238, 62","4, 22, 44"]
[null,null,"SF","204, 174, 116","164, 30, 52"]
[null,null,"STL","204, 178, 116","12, 38, 76"]
[null,null,"TB","212, 10, 10","100, 89, 73"]
[null,null,"TEN","148, 177, 220","12, 38, 76"]
[null,null,"WAS","246, 199, 0","132, 0, 49"]
[]
[]
[]
[null,null,"WEEK_LIST"]
[null,null,"Week 1"]
[null,null,"Week 2"]
[null,null,"Week 3"]
[null,null,"Week 4"]
[null,null,"Week 5"]
[null,null,"Week 6"]
[null,null,"Week 7"]
[null,null,"Week 8"]
[null,null,"Week 9"]
[null,null,"Week 10"]
[null,null,"Week 11"]
[null,null,"Week 12"]
[null,null,"Week 13"]
[null,null,"Week 14"]
[null,null,"Week 15"]
[null,null,"Week 16"]
[null,null,"Week 17"]

{"sheet":"Schedule","index":19,"n_rows":68,"n_cols":18,"rows_kept":68,"cut":false,"hidden":true,"merged":[]}
[]
["Week 1",{"$f":"A2&\" Visitors\"","v":"Week 1 Visitors"},"GB","NO","CIN","BUF","WAS","TEN","NE","OAK","JAX","CLE","MIN","SF","CAR","IND","NYG","SD"]
[null,null,"at","at","at","at","at","at","at","at","at","at","at","at","at","at","at","at"]
[null,{"$f":"A2&\" Homes\"","v":"Week 1 Homes"},"SEA","ATL","BAL","CHI","HOU","KC","MIA","NYJ","PHI","PIT","STL","DAL","TB","DEN","DET","ARI"]
[]
["Week 2",{"$f":"A6&\" Visitors\"","v":"Week 2 Visitors"},"PIT","MIA","DET","ATL","NO","NE","ARI","DAL","JAX","SEA","STL","KC","NYJ","HOU","CHI","PHI"]
[null,null,"at","at","at","at","at","at","at","at","at","at","at","at","at","at","at","at"]
[null,{"$f":"A6&\" Homes\"","v":"Week 2 Homes"},"BAL","BUF","CAR","CIN","CLE","MIN","NYG","TEN","WAS","SD","TB","DEN","GB","OAK","SF","IND"]
[]
["Week 3",{"$f":"A10&\" Visitors\"","v":"Week 3 Visitors"},"TB","SD","TEN","BAL","GB","IND","OAK","MIN","HOU","WAS","DAL","SF","KC","DEN","PIT","CHI"]
[null,null,"at","at","at","at","at","at","at","at","at","at","at","at","at","at","at","at"]
[null,{"$f":"A10&\" Homes\"","v":"Week 3 Homes"},"ATL","BUF","CIN","CLE","DET","JAX","NE","NO","NYG","PHI","STL","ARI","MIA","SEA","CAR","NYJ"]
[]
["Week 4",{"$f":"A14&\" Visitors\"","v":"Week 4 Visitors"},"NYG","CAR","GB","BUF","TEN","ATL","DET","MIA","TB","JAX","PHI","NO","NE"]
[null,null,"at","at","at","at","at","at","at","at","at","at","at","at","at"]
[null,{"$f":"A14&\" Homes\"","v":"Week 4 Homes"},"WAS","BAL","CHI","HOU","IND","MIN","NYJ","OAK","PIT","SD","SF","DAL","KC"]
[]
["Week 5",{"$f":"A18&\" Visitors\"","v":"Week 5 Visitors"},"MIN","CHI","HOU","BUF","BAL","PIT","TB","ATL","STL","CLE","ARI","NYJ","KC","CIN","SEA"]
[null,null,"at","at","at","at","at","at","at","at","at","at","at","at","at","at","at"]
[null,{"$f":"A18&\" Homes\"","v":"Week 5 Homes"},"GB","CAR","DAL","DET","IND","JAX","NO","NYG","PHI","TEN","DEN","SD","SF","NE","WAS"]
[]
["Week 6",{"$f":"A22&\" Visitors\"","v":"Week 6 Visitors"},"IND","CHI","NE","CAR","PIT","GB","DET","DEN","BAL","JAX","SD","WAS","DAL","NYG","SF"]
[null,null,"at","at","at","at","at","at","at","at","at","at","at","at","at","at","at"]
[null,{"$f":"A22&\" Homes\"","v":"Week 6 Homes"},"HOU","ATL","BUF","CIN","CLE","MIA","MIN","NYJ","TB","TEN","OAK","ARI","SEA","PHI","STL"]
[]
["Week 7",{"$f":"A26&\" Visitors\"","v":"Week 7 Visitors"},"NYJ","ATL","MIN","MIA","NO","CAR","CIN","CLE","SEA","TEN","KC","NYG","ARI","SF","HOU"]
[null,null,"at","at","at","at","at","at","at","at","at","at","at","at","at","at","at"]
[null,{"$f":"A26&\" Homes\"","v":"Week 7 Homes"},"NE","BAL","BUF","CHI","DET","GB","IND","JAX","STL","WAS","SD","DAL","OAK","DEN","PIT"]
[]
["Week 8",{"$f":"A30&\" Visitors\"","v":"Week 8 Visitors"},"SD","DET","SEA","BAL","MIA","STL","CHI","BUF","MIN","HOU","PHI","OAK","IND","GB","WAS"]
[null,null,"at","at","at","at","at","at","at","at","at","at","at","at","at","at","at"]
[null,{"$f":"A30&\" Homes\"","v":"Week 8 Homes"},"DEN","ATL","CAR","CIN","JAX","KC","NE","NYJ","TB","TEN","ARI","CLE","PIT","NO","DAL"]
[]
["Week 9",{"$f":"A34&\" Visitors\"","v":"Week 9 Visitors"},"NO","JAX","TB","ARI","PHI","NYJ","SD","WAS","STL","DEN","OAK","BAL","IND"]
[null,null,"at","at","at","at","at","at","at","at","at","at","at","at","at"]
[null,{"$f":"A34&\" Homes\"","v":"Week 9 Homes"},"CAR","CIN","CLE","DAL","HOU","KC","MIA","MIN","SF","NE","SEA","PIT","NYG"]
[]
["Week 10",{"$f":"A38&\" Visitors\"","v":"Week 10 Visitors"},"CLE","TEN","KC","MIA","DAL","SF","PIT","ATL","DEN","STL","NYG","CHI","CAR"]
[null,null,"at","at","at","at","at","at","at","at","at","at","at","at","at"]
[null,{"$f":"A38&\" Homes\"","v":"Week 10 Homes"},"CIN","BAL","BUF","DET","JAX","NO","NYJ","TB","OAK","ARI","SEA","GB","PHI"]
[]
["Week 11",{"$f":"A42&\" Visitors\"","v":"Week 11 Visitors"},"BUF","ATL","MIN","HOU","PHI","SEA","CIN","SF","DEN","TB","OAK","DET","NE","PIT"]
[null,null,"at","at","at","at","at","at","at","at","at","at","at","at","at","at"]
[null,{"$f":"A42&\" Homes\"","v":"Week 11 Homes"},"MIA","CAR","CHI","CLE","GB","KC","NO","NYG","STL","WAS","SD","ARI","IND","TEN"]
[]
["Week 12",{"$f":"A46&\" Visitors\"","v":"Week 12 Visitors"},"KC","CLE","NYJ","TB","CIN","JAX","GB","DET","TEN","STL","ARI","MIA","WAS","DAL","BAL"]
[null,null,"at","at","at","at","at","at","at","at","at","at","at","at","at","at","at"]
[null,{"$f":"A46&\" Homes\"","v":"Week 12 Homes"},"OAK","ATL","BUF","CHI","HOU","IND","MIN","NE","PHI","SD","SEA","DEN","SF","NYG","NO"]
[]
["Week 13",{"$f":"A50&\" Visitors\"","v":"Week 13 Visitors"},"CHI","PHI","SEA","SD","CLE","TEN","WAS","NYG","CAR","NO","OAK","CIN","ARI","NE","DEN","MIA"]
[null,null,"at","at","at","at","at","at","at","at","at","at","at","at","at","at","at","at"]
[null,{"$f":"A50&\" Homes\"","v":"Week 13 Homes"},"DET","DAL","SF","BAL","BUF","HOU","IND","JAX","MIN","PIT","STL","TB","ATL","GB","KC","NYJ"]
[]
["Week 14",{"$f":"A54&\" Visitors\"","v":"Week 14 Visitors"},"DAL","PIT","IND","TB","HOU","BAL","NYJ","CAR","NYG","STL","KC","BUF","SF","SEA","NE","ATL"]
[null,null,"at","at","at","at","at","at","at","at","at","at","at","at","at","at","at","at"]
[null,{"$f":"A54&\" Homes\"","v":"Week 14 Homes"},"CHI","CIN","CLE","DET","JAX","MIA","MIN","NO","TEN","WAS","ARI","DEN","OAK","PHI","SD","GB"]
[]
["Week 15",{"$f":"A58&\" Visitors\"","v":"Week 15 Visitors"},"ARI","PIT","JAX","GB","TB","CIN","MIN","HOU","OAK","MIA","WAS","DEN","NYJ","SF","DAL","NO"]
[null,null,"at","at","at","at","at","at","at","at","at","at","at","at","at","at","at","at"]
[null,{"$f":"A58&\" Homes\"","v":"Week 15 Homes"},"STL","ATL","BAL","BUF","CAR","CLE","DET","IND","KC","NE","NYG","SD","TEN","SEA","PHI","CHI"]
[]
["Week 16",{"$f":"A62&\" Visitors\"","v":"Week 16 Visitors"},"TEN","SD","PHI","CLE","DET","BAL","MIN","ATL","NE","KC","GB","NYG","IND","BUF","SEA","DEN"]
[null,null,"at","at","at","at","at","at","at","at","at","at","at","at","at","at","at","at"]
[null,{"$f":"A62&\" Homes\"","v":"Week 16 Homes"},"JAX","SF","WAS","CAR","CHI","HOU","MIA","NO","NYJ","PIT","TB","STL","DAL","OAK","ARI","CIN"]
[]
["Week 17",{"$f":"A66&\" Visitors\"","v":"Week 17 Visitors"},"CAR","CLE","DET","JAX","SD","NYJ","CHI","BUF","PHI","CIN","NO","IND","DAL","OAK","ARI","STL"]
[null,null,"at","at","at","at","at","at","at","at","at","at","at","at","at","at","at","at"]
[null,{"$f":"A66&\" Homes\"","v":"Week 17 Homes"},"ATL","BAL","GB","HOU","KC","MIA","MIN","NE","NYG","PIT","TB","TEN","WAS","DEN","SF","SEA"]