{"text_format":"1","workbook":"xlsx","n_sheets":20,"sheets":["Week 1","Week 2","Week 3","Week 4","Week 5","Week 6","Week 7","Week 8","Week 9","Week 10","Week 11","Week 12","Week 13","Week 14","Week 15","Week 16","Week 17","cumulative_points","dev_notes","Schedule"],"not_rendered":{"charts":0,"images":0,"macros":1,"external_links":0,"defined_names":38,"comments":0,"pivot_tables":0},"unopened":[],"bounds":{"document_bytes":16777216,"sheet_cells":100000,"rows_first":2000,"rows_last":500,"rows_between":2000,"halvings":0,"cell_chars":16384,"cell_head_chars":4096},"cells_cut":0,"cells_raw":0,"read":"whole","date_system":"1900"}

{"sheet":"Week 1","index":0,"n_rows":110,"n_cols":41,"rows_kept":110,"cut":false,"hidden":false,"merged":[[9,17,9,18],[1,17,1,18],[4,23,9,23],[1,19,3,23]]}
["Week Lookup Column Offset",2,3,4,5,6,7,8,9,10,11,12,13,14,15,16,17]
[null,"GAME 1","GAME 2","GAME 3","GAME 4","GAME 5","GAME 6","GAME 7","GAME 8","GAME 9","GAME 10","GAME 11","GAME 12","GAME 13","GAME 14","GAME 15","GAME 16","SCORE",null,"Week 1"]
["VISITOR",{"$f":"IF(VLOOKUP($T$2&\" Visitors\",SCHEDULE_TABLE,B$1,FALSE)=0,\"\",VLOOKUP($T$2&\" Visitors\",SCHEDULE_TABLE,B$1,FALSE))","v":"GB"},"NO","CIN","BUF","WAS","TEN","NE","OAK","JAX","CLE","MIN","SF","CAR","IND","NYG","SD",null,"pts"]
[null,"at","at","at","at","at","at","at","at","at","at","at","at","at","at","at","at"]
["HOME",{"$f":"IF(VLOOKUP($T$2&\" Homes\",SCHEDULE_TABLE,B$1,FALSE)=0,\"\",VLOOKUP($T$2&\" Homes\",SCHEDULE_TABLE,B$1,FALSE))","v":"SEA"},"ATL","BAL","CHI","HOU","KC","MIA","NYJ","PHI","PIT","STL","DAL","TB","DEN","DET","ARI",null,"pts",null,null,null,null,"TOTAL POINTS FOR YEAR"]
["WINNER",null,null,null,null,null,null,null,null,null,null,null,null,null,null,null,null,{"$f":"IF(R3+R5=0,\"\",R3+R5)","v":""},"pts"]
{"$rows_left_out":105}
{"sheet":"Week 2","index":1,"n_rows":110,"n_cols":41,"rows_kept":110,"cut":false,"hidden":false,"merged":[[1,17,1,18],[1,19,3,23],[4,23,9,23],[9,17,9,18]]}
["Week Lookup Column Offset",2,3,4,5,6,7,8,9,10,11,12,13,14,15,16,17,null,null,null,null,null,null,{"$f":"MID(T2,FIND(\" \",T2)+1,2)*1+18","v":20}]
[null,"GAME 1","GAME 2","GAME 3","GAME 4","GAME 5","GAME 6","GAME 7","GAME 8","GAME 9","GAME 10","GAME 11","GAME 12","GAME 13","GAME 14","GAME 15","GAME 16","SCORE",null,"Week 2"]
["VISITOR",{"$f":"IF(VLOOKUP($T$2&\" Visitors\",SCHEDULE_TABLE,B$1,FALSE)=0,\"\",VLOOKUP($T$2&\" Visitors\",SCHEDULE_TABLE,B$1,FALSE))","v":"PIT"},"MIA","DET","ATL","NO","NE","ARI","DAL","JAX","SEA","STL","KC","NYJ","HOU","CHI","PHI",null,"pts"]
[null,"at","at","at","at","at","at","at","at","at","at","at","at","at","at","at","at"]
["HOME",{"$f":"IF(VLOOKUP($T$2&\" Homes\",SCHEDULE_TABLE,B$1,FALSE)=0,\"\",VLOOKUP($T$2&\" Homes\",SCHEDULE_TABLE,B$1,FALSE))","v":"BAL"},"BUF","CAR","CIN","CLE","MIN","NYG","TEN","WAS","SD","TB","DEN","GB","OAK","SF","IND",null,"pts",null,null,null,null,"TOTAL POINTS FOR YEAR"]
["WINNER",null,null,null,null,null,null,null,null,null,null,null,null,null,null,null,null,{"$f":"IF(R3+R5=0,\"\",R3+R5)","v":""},"pts"]
{"$rows_left_out":105}
{"sheet":"Week 3","index":2,"n_rows":110,"n_cols":41,"rows_kept":110,"cut":false,"hidden":false,"merged":[[1,17,1,18],[1,19,3,23],[4,23,9,23],[9,17,9,18]]}
["Week Lookup Column Offset",2,3,4,5,6,7,8,9,10,11,12,13,14,15,16,17,null,null,null,null,null,null,{"$f":"MID(T2,FIND(\" \",T2)+1,2)*1+18","v":21}]
[null,"GAME 1","GAME 2","GAME 3","GAME 4","GAME 5","GAME 6","GAME 7","GAME 8","GAME 9","GAME 10","GAME 11","GAME 12","GAME 13","GAME 14","GAME 15","GAME 16","SCORE",null,"Week 3"]
["VISITOR",{"$f":"IF(VLOOKUP($T$2&\" Visitors\",SCHEDULE_TABLE,B$1,FALSE)=0,\"\",VLOOKUP($T$2&\" Visitors\",SCHEDULE_TABLE,B$1,FALSE))","v":"TB"},"SD","TEN","BAL","GB","IND","OAK","MIN","HOU","WAS","DAL","SF","KC","DEN","PIT","CHI",null,"pts"]
[null,"at","at","at","at","at","at","at","at","at","at","at","at","at","at","at","at"]
["HOME",{"$f":"IF(VLOOKUP($T$2&\" Homes\",SCHEDULE_TABLE,B$1,FALSE)=0,\"\",VLOOKUP($T$2&\" Homes\",SCHEDULE_TABLE,B$1,FALSE))","v":"ATL"},"BUF","CIN","CLE","DET","JAX","NE","NO","NYG","PHI","STL","ARI","MIA","SEA","CAR","NYJ",null,"pts",null,null,null,null,"TOTAL POINTS FOR YEAR"]
["WINNER",null,null,null,null,null,null,null,null,null,null,null,null,null,null,null,null,{"$f":"IF(R3+R5=0,\"\",R3+R5)","v":""},"pts"]
{"$rows_left_out":105}
{"sheet":"Week 4","index":3,"n_rows":110,"n_cols":41,"rows_kept":110,"cut":false,"hidden":false,"merged":[[1,17,1,18],[1,19,3,23],[4,23,9,23],[9,17,9,18]]}
["Week Lookup Column Offset",2,3,4,5,6,7,8,9,10,11,12,13,14,15,16,17,null,null,null,null,null,null,{"$f":"MID(T2,FIND(\" \",T2)+1,2)*1+18","v":22}]
[null,"GAME 1","GAME 2","GAME 3","GAME 4","GAME 5","GAME 6","GAME 7","GAME 8","GAME 9","GAME 10","GAME 11","GAME 12","GAME 13","GAME 14","GAME 15","GAME 16","SCORE",null,"Week 4"]
["VISITOR",{"$f":"IF(VLOOKUP($T$2&\" Visitors\",SCHEDULE_TABLE,B$1,FALSE)=0,\"\",VLOOKUP($T$2&\" Visitors\",SCHEDULE_TABLE,B$1,FALSE))","v":"NYG"},"CAR","GB","BUF","TEN","ATL","DET","MIA","TB","JAX","PHI","NO","NE","","","",null,"pts"]
[null,"at","at","at","at","at","at","at","at","at","at","at","at","at","at","at","at"]
["HOME",{"$f":"IF(VLOOKUP($T$2&\" Homes\",SCHEDULE_TABLE,B$1,FALSE)=0,\"\",VLOOKUP($T$2&\" Homes\",SCHEDULE_TABLE,B$1,FALSE))","v":"WAS"},"BAL","CHI","HOU","IND","MIN","NYJ","OAK","PIT","SD","SF","DAL","KC","","","",null,"pts",null,null,null,null,"TOTAL POINTS FOR YEAR"]
["WINNER",null,null,null,null,null,null,null,null,null,null,null,null,null,null,null,null,{"$f":"IF(R3+R5=0,\"\",R3+R5)","v":""},"pts"]
{"$rows_left_out":105}
{"sheet":"Week 5","index":4,"n_rows":110,"n_cols":41,"rows_kept":110,"cut":false,"hidden":false,"merged":[[1,17,1,18],[1,19,3,23],[4,23,9,23],[9,17,9,18]]}
["Week Lookup Column Offset",2,3,4,5,6,7,8,9,10,11,12,13,14,15,16,17,null,null,null,null,null,null,{"$f":"MID(T2,FIND(\" \",T2)+1,2)*1+18","v":23}]
[null,"GAME 1","GAME 2","GAME 3","GAME 4","GAME 5","GAME 6","GAME 7","GAME 8","GAME 9","GAME 10","GAME 11","GAME 12","GAME 13","GAME 14","GAME 15","GAME 16","SCORE",null,"Week 5"]
["VISITOR",{"$f":"IF(VLOOKUP($T$2&\" Visitors\",SCHEDULE_TABLE,B$1,FALSE)=0,\"\",VLOOKUP($T$2&\" Visitors\",SCHEDULE_TABLE,B$1,FALSE))","v":"MIN"},"CHI","HOU","BUF","BAL","PIT","TB","ATL","STL","CLE","ARI","NYJ","KC","CIN","SEA","",null,"pts"]
[null,"at","at","at","at","at","at","at","at","at","at","at","at","at","at","at","at"]
["HOME",{"$f":"IF(VLOOKUP($T$2&\" Homes\",SCHEDULE_TABLE,B$1,FALSE)=0,\"\",VLOOKUP($T$2&\" Homes\",SCHEDULE_TABLE,B$1,FALSE))","v":"GB"},"CAR","DAL","DET","IND","JAX","NO","NYG","PHI","TEN","DEN","SD","SF","NE","WAS","",null,"pts",null,null,null,null,"TOTAL POINTS FOR YEAR"]
["WINNER",null,null,null,null,null,null,null,null,null,null,null,null,null,null,null,null,{"$f":"IF(R3+R5=0,\"\",R3+R5)","v":""},"pts"]
{"$rows_left_out":105}
{"sheet":"Week 6","index":5,"n_rows":110,"n_cols":41,"rows_kept":110,"cut":false,"hidden":false,"merged":[[1,17,1,18],[1,19,3,23],[4,23,9,23],[9,17,9,18]]}
["Week Lookup Column Offset",2,3,4,5,6,7,8,9,10,11,12,13,14,15,16,17,null,null,null,null,null,null,{"$f":"MID(T2,FIND(\" \",T2)+1,2)*1+18","v":24}]
[null,"GAME 1","GAME 2","GAME 3","GAME 4","GAME 5","GAME 6","GAME 7","GAME 8","GAME 9","GAME 10","GAME 11","GAME 12","GAME 13","GAME 14","GAME 15","GAME 16","SCORE",null,"Week 6"]
["VISITOR",{"$f":"IF(VLOOKUP($T$2&\" Visitors\",SCHEDULE_TABLE,B$1,FALSE)=0,\"\",VLOOKUP($T$2&\" Visitors\",SCHEDULE_TABLE,B$1,FALSE))","v":"IND"},"CHI","NE","CAR","PIT","GB","DET","DEN","BAL","JAX","SD","WAS","DAL","NYG","SF","",null,"pts"]
[null,"at","at","at","at","at","at","at","at","at","at","at","at","at","at","at","at"]
["HOME",{"$f":"IF(VLOOKUP($T$2&\" Homes\",SCHEDULE_TABLE,B$1,FALSE)=0,\"\",VLOOKUP($T$2&\" Homes\",SCHEDULE_TABLE,B$1,FALSE))","v":"HOU"},"ATL","BUF","CIN","CLE","MIA","MIN","NYJ","TB","TEN","OAK","ARI","SEA","PHI","STL","",null,"pts",null,null,null,null,"TOTAL POINTS FOR YEAR"]
["WINNER",null,null,null,null,null,null,null,null,null,null,null,null,null,null,null,null,{"$f":"IF(R3+R5=0,\"\",R3+R5)","v":""},"pts"]
{"$rows_left_out":105}
{"sheet":"Week 7","index":6,"n_rows":110,"n_cols":41,"rows_kept":110,"cut":false,"hidden":false,"merged":[[1,17,1,18],[1,19,3,23],[4,23,9,23],[9,17,9,18]]}
["Week Lookup Column Offset",2,3,4,5,6,7,8,9,10,11,12,13,14,15,16,17,null,null,null,null,null,null,{"$f":"MID(T2,FIND(\" \",T2)+1,2)*1+18","v":25}]
[null,"GAME 1","GAME 2","GAME 3","GAME 4","GAME 5","GAME 6","GAME 7","GAME 8","GAME 9","GAME 10","GAME 11","GAME 12","GAME 13","GAME 14","GAME 15","GAME 16","SCORE",null,"Week 7"]
["VISITOR",{"$f":"IF(VLOOKUP($T$2&\" Visitors\",SCHEDULE_TABLE,B$1,FALSE)=0,\"\",VLOOKUP($T$2&\" Visitors\",SCHEDULE_TABLE,B$1,FALSE))","v":"NYJ"},"ATL","MIN","MIA","NO","CAR","CIN","CLE","SEA","TEN","KC","NYG","ARI","SF","HOU","",null,"pts"]
[null,"at","at","at","at","at","at","at","at","at","at","at","at","at","at","at","at"]
["HOME",{"$f":"IF(VLOOKUP($T$2&\" Homes\",SCHEDULE_TABLE,B$1,FALSE)=0,\"\",VLOOKUP($T$2&\" Homes\",SCHEDULE_TABLE,B$1,FALSE))","v":"NE"},"BAL","BUF","CHI","DET","GB","IND","JAX","STL","WAS","SD","DAL","OAK","DEN","PIT","",null,"pts",null,null,null,null,"TOTAL POINTS FOR YEAR"]
["WINNER",null,null,null,null,null,null,null,null,null,null,null,null,null,null,null,null,{"$f":"IF(R3+R5=0,\"\",R3+R5)","v":""},"pts"]
{"$rows_left_out":105}
{"sheet":"Week 8","index":7,"n_rows":110,"n_cols":41,"rows_kept":110,"cut":false,"hidden":false,"merged":[[1,17,1,18],[1,19,3,23],[4,23,9,23],[9,17,9,18]]}
["Week Lookup Column Offset",2,3,4,5,6,7,8,9,10,11,12,13,14,15,16,17,null,null,null,null,null,null,{"$f":"MID(T2,FIND(\" \",T2)+1,2)*1+18","v":26}]
[null,"GAME 1","GAME 2","GAME 3","GAME 4","GAME 5","GAME 6","GAME 7","GAME 8","GAME 9","GAME 10","GAME 11","GAME 12","GAME 13","GAME 14","GAME 15","GAME 16","SCORE",null,"Week 8"]
["VISITOR",{"$f":"IF(VLOOKUP($T$2&\" Visitors\",SCHEDULE_TABLE,B$1,FALSE)=0,\"\",VLOOKUP($T$2&\" Visitors\",SCHEDULE_TABLE,B$1,FALSE))","v":"SD"},"DET","SEA","BAL","MIA","STL","CHI","BUF","MIN","HOU","PHI","OAK","IND","GB","WAS","",null,"pts"]
[null,"at","at","at","at","at","at","at","at","at","at","at","at","at","at","at","at"]
["HOME",{"$f":"IF(VLOOKUP($T$2&\" Homes\",SCHEDULE_TABLE,B$1,FALSE)=0,\"\",VLOOKUP($T$2&\" Homes\",SCHEDULE_TABLE,B$1,FALSE))","v":"DEN"},"ATL","CAR","CIN","JAX","KC","NE","NYJ","TB","TEN","ARI","CLE","PIT","NO","DAL","",null,"pts",null,null,null,null,"TOTAL POINTS FOR YEAR"]
["WINNER",null,null,null,null,null,null,null,null,null,null,null,null,null,null,null,null,{"$f":"IF(R3+R5=0,\"\",R3+R5)","v":""},"pts"]
{"$rows_left_out":105}
{"sheet":"Week 9","index":8,"n_rows":110,"n_cols":41,"rows_kept":110,"cut":false,"hidden":false,"merged":[[1,17,1,18],[1,19,3,23],[4,23,9,23],[9,17,9,18]]}
["Week Lookup Column Offset",2,3,4,5,6,7,8,9,10,11,12,13,14,15,16,17,null,null,null,null,null,null,{"$f":"MID(T2,FIND(\" \",T2)+1,2)*1+18","v":27}]
[null,"GAME 1","GAME 2","GAME 3","GAME 4","GAME 5","GAME 6","GAME 7","GAME 8","GAME 9","GAME 10","GAME 11","GAME 12","GAME 13","GAME 14","GAME 15","GAME 16","SCORE",null,"Week 9"]
["VISITOR",{"$f":"IF(VLOOKUP($T$2&\" Visitors\",SCHEDULE_TABLE,B$1,FALSE)=0,\"\",VLOOKUP($T$2&\" Visitors\",SCHEDULE_TABLE,B$1,FALSE))","v":"NO"},"JAX","TB","ARI","PHI","NYJ","SD","WAS","STL","DEN","OAK","BAL","IND","","","",null,"pts"]
[null,"at","at","at","at","at","at","at","at","at","at","at","at","at","at","at","at"]
["HOME",{"$f":"IF(VLOOKUP($T$2&\" Homes\",SCHEDULE_TABLE,B$1,FALSE)=0,\"\",VLOOKUP($T$2&\" Homes\",SCHEDULE_TABLE,B$1,FALSE))","v":"CAR"},"CIN","CLE","DAL","HOU","KC","MIA","MIN","SF","NE","SEA","PIT","NYG","","","",null,"pts",null,null,null,null,"TOTAL POINTS FOR YEAR"]
["WINNER",null,null,null,null,null,null,null,null,null,null,null,null,null,null,null,null,{"$f":"IF(R3+R5=0,\"\",R3+R5)","v":""},"pts"]
{"$rows_left_out":105}
{"sheet":"Week 10","index":9,"n_rows":110,"n_cols":41,"rows_kept":110,"cut":false,"hidden":false,"merged":[[1,17,1,18],[1,19,3,23],[4,23,9,23],[9,17,9,18]]}
["Week Lookup Column Offset",2,3,4,5,6,7,8,9,10,11,12,13,14,15,16,17,null,null,null,null,null,null,{"$f":"MID(T2,FIND(\" \",T2)+1,2)*1+18","v":28}]
[null,"GAME 1","GAME 2","GAME 3","GAME 4","GAME 5","GAME 6","GAME 7","GAME 8","GAME 9","GAME 10","GAME 11","GAME 12","GAME 13","GAME 14","GAME 15","GAME 16","SCORE",null,"Week 10"]
["VISITOR",{"$f":"IF(VLOOKUP($T$2&\" Visitors\",SCHEDULE_TABLE,B$1,FALSE)=0,\"\",VLOOKUP($T$2&\" Visitors\",SCHEDULE_TABLE,B$1,FALSE))","v":"CLE"},"TEN","KC","MIA","DAL","SF","PIT","ATL","DEN","STL","NYG","CHI","CAR","","","",null,"pts"]
[null,"at","at","at","at","at","at","at","at","at","at","at","at","at","at","at","at"]
["HOME",{"$f":"IF(VLOOKUP($T$2&\" Homes\",SCHEDULE_TABLE,B$1,FALSE)=0,\"\",VLOOKUP($T$2&\" Homes\",SCHEDULE_TABLE,B$1,FALSE))","v":"CIN"},"BAL","BUF","DET","JAX","NO","NYJ","TB","OAK","ARI","SEA","GB","PHI","","","",null,"pts",null,null,null,null,"TOTAL POINTS FOR YEAR"]
["WINNER",null,null,null,null,null,null,null,null,null,null,null,null,null,null,null,null,{"$f":"IF(R3+R5=0,\"\",R3+R5)","v":""},"pts"]
{"$rows_left_out":105}
{"sheet":"Week 11","index":10,"n_rows":110,"n_cols":41,"rows_kept":110,"cut":false,"hidden":false,"merged":[[1,17,1,18],[1,19,3,23],[4,23,9,23],[9,17,9,18]]}
["Week Lookup Column Offset",2,3,4,5,6,7,8,9,10,11,12,13,14,15,16,17,null,null,null,null,null,null,{"$f":"MID(T2,FIND(\" \",T2)+1,2)*1+18","v":29}]
[null,"GAME 1","GAME 2","GAME 3","GAME 4","GAME 5","GAME 6","GAME 7","GAME 8","GAME 9","GAME 10","GAME 11","GAME 12","GAME 13","GAME 14","GAME 15","GAME 16","SCORE",null,"Week 11"]
["VISITOR",{"$f":"IF(VLOOKUP($T$2&\" Visitors\",SCHEDULE_TABLE,B$1,FALSE)=0,\"\",VLOOKUP($T$2&\" Visitors\",SCHEDULE_TABLE,B$1,FALSE))","v":"BUF"},"ATL","MIN","HOU","PHI","SEA","CIN","SF","DEN","TB","OAK","DET","NE","PIT","","",null,"pts"]
[null,"at","at","at","at","at","at","at","at","at","at","at","at","at","at","at","at"]
["HOME",{"$f":"IF(VLOOKUP($T$2&\" Homes\",SCHEDULE_TABLE,B$1,FALSE)=0,\"\",VLOOKUP($T$2&\" Homes\",SCHEDULE_TABLE,B$1,FALSE))","v":"MIA"},"CAR","CHI","CLE","GB","KC","NO","NYG","STL","WAS","SD","ARI","IND","TEN","","",null,"pts",null,null,null,null,"TOTAL POINTS FOR YEAR"]
["WINNER",null,null,null,null,null,null,null,null,null,null,null,null,null,null,null,null,{"$f":"IF(R3+R5=0,\"\",R3+R5)","v":""},"pts"]
{"$rows_left_out":105}
{"sheet":"Week 12","index":11,"n_rows":110,"n_cols":41,"rows_kept":110,"cut":false,"hidden":false,"merged":[[1,17,1,18],[1,19,3,23],[4,23,9,23],[9,17,9,18]]}
["Week Lookup Column Offset",2,3,4,5,6,7,8,9,10,11,12,13,14,15,16,17,null,null,null,null,null,null,{"$f":"MID(T2,FIND(\" \",T2)+1,2)*1+18","v":30}]
[null,"GAME 1","GAME 2","GAME 3","GAME 4","GAME 5","GAME 6","GAME 7","GAME 8","GAME 9","GAME 10","GAME 11","GAME 12","GAME 13","GAME 14","GAME 15","GAME 16","SCORE",null,"Week 12"]
["VISITOR",{"$f":"IF(VLOOKUP($T$2&\" Visitors\",SCHEDULE_TABLE,B$1,FALSE)=0,\"\",VLOOKUP($T$2&\" Visitors\",SCHEDULE_TABLE,B$1,FALSE))","v":"KC"},"CLE","NYJ","TB","CIN","JAX","GB","DET","TEN","STL","ARI","MIA","WAS","DAL","BAL","",null,"pts"]
[null,"at","at","at","at","at","at","at","at","at","at","at","at","at","at","at","at"]
["HOME",{"$f":"IF(VLOOKUP($T$2&\" Homes\",SCHEDULE_TABLE,B$1,FALSE)=0,\"\",VLOOKUP($T$2&\" Homes\",SCHEDULE_TABLE,B$1,FALSE))","v":"OAK"},"ATL","BUF","CHI","HOU","IND","MIN","NE","PHI","SD","SEA","DEN","SF","NYG","NO","",null,"pts",null,null,null,null,"TOTAL POINTS FOR YEAR"]
["WINNER",null,null,null,null,null,null,null,null,null,null,null,null,null,null,null,null,{"$f":"IF(R3+R5=0,\"\",R3+R5)","v":""},"pts"]
{"$rows_left_out":105}
{"sheet":"Week 13","index":12,"n_rows":110,"n_cols":41,"rows_kept":110,"cut":false,"hidden":false,"merged":[[1,17,1,18],[1,19,3,23],[4,23,9,23],[9,17,9,18]]}
["Week Lookup Column Offset",2,3,4,5,6,7,8,9,10,11,12,13,14,15,16,17,null,null,null,null,null,null,{"$f":"MID(T2,FIND(\" \",T2)+1,2)*1+18","v":31}]
[null,"GAME 1","GAME 2","GAME 3","GAME 4","GAME 5","GAME 6","GAME 7","GAME 8","GAME 9","GAME 10","GAME 11","GAME 12","GAME 13","GAME 14","GAME 15","GAME 16","SCORE",null,"Week 13"]
["VISITOR",{"$f":"IF(VLOOKUP($T$2&\" Visitors\",SCHEDULE_TABLE,B$1,FALSE)=0,\"\",VLOOKUP($T$2&\" Visitors\",SCHEDULE_TABLE,B$1,FALSE))","v":"CHI"},"PHI","SEA","SD","CLE","TEN","WAS","NYG","CAR","NO","OAK","CIN","ARI","NE","DEN","MIA",null,"pts"]
[null,"at","at","at","at","at","at","at","at","at","at","at","at","at","at","at","at"]
["HOME",{"$f":"IF(VLOOKUP($T$2&\" Homes\",SCHEDULE_TABLE,B$1,FALSE)=0,\"\",VLOOKUP($T$2&\" Homes\",SCHEDULE_TABLE,B$1,FALSE))","v":"DET"},"DAL","SF","BAL","BUF","HOU","IND","JAX","MIN","PIT","STL","TB","ATL","GB","KC","NYJ",null,"pts",null,null,null,null,"TOTAL POINTS FOR YEAR"]
["WINNER",null,null,null,null,null,null,null,null,null,null,null,null,null,null,null,null,{"$f":"IF(R3+R5=0,\"\",R3+R5)","v":""},"pts"]
{"$rows_left_out":105}
{"sheet":"Week 14","index":13,"n_rows":110,"n_cols":41,"rows_kept":110,"cut":false,"hidden":false,"merged":[[1,17,1,18],[1,19,3,23],[4,23,9,23],[9,17,9,18]]}
["Week Lookup Column Offset",2,3,4,5,6,7,8,9,10,11,12,13,14,15,16,17,null,null,null,null,null,null,{"$f":"MID(T2,FIND(\" \",T2)+1,2)*1+18","v":32}]
[null,"GAME 1","GAME 2","GAME 3","GAME 4","GAME 5","GAME 6","GAME 7","GAME 8","GAME 9","GAME 10","GAME 11","GAME 12","GAME 13","GAME 14","GAME 15","GAME 16","SCORE",null,"Week 14"]
["VISITOR",{"$f":"IF(VLOOKUP($T$2&\" Visitors\",SCHEDULE_TABLE,B$1,FALSE)=0,\"\",VLOOKUP($T$2&\" Visitors\",SCHEDULE_TABLE,B$1,FALSE))","v":"DAL"},"PIT","IND","TB","HOU","BAL","NYJ","CAR","NYG","STL","KC","BUF","SF","SEA","NE","ATL",null,"pts"]
[null,"at","at","at","at","at","at","at","at","at","at","at","at","at","at","at","at"]
["HOME",{"$f":"IF(VLOOKUP($T$2&\" Homes\",SCHEDULE_TABLE,B$1,FALSE)=0,\"\",VLOOKUP($T$2&\" Homes\",SCHEDULE_TABLE,B$1,FALSE))","v":"CHI"},"CIN","CLE","DET","JAX","MIA","MIN","NO","TEN","WAS","ARI","DEN","OAK","PHI","SD","GB",null,"pts",null,null,null,null,"TOTAL POINTS FOR YEAR"]
["WINNER",null,null,null,null,null,null,null,null,null,null,null,null,null,null,null,null,{"$f":"IF(R3+R5=0,\"\",R3+R5)","v":""},"pts"]
{"$rows_left_out":105}
{"sheet":"Week 15","index":14,"n_rows":110,"n_cols":41,"rows_kept":110,"cut":false,"hidden":false,"merged":[[1,17,1,18],[1,19,3,23],[4,23,9,23],[9,17,9,18]]}
["Week Lookup Column Offset",2,3,4,5,6,7,8,9,10,11,12,13,14,15,16,17,null,null,null,null,null,null,{"$f":"MID(T2,FIND(\" \",T2)+1,2)*1+18","v":33}]
[null,"GAME 1","GAME 2","GAME 3","GAME 4","GAME 5","GAME 6","GAME 7","GAME 8","GAME 9","GAME 10","GAME 11","GAME 12","GAME 13","GAME 14","GAME 15","GAME 16","SCORE",null,"Week 15"]
["VISITOR",{"$f":"IF(VLOOKUP($T$2&\" Visitors\",SCHEDULE_TABLE,B$1,FALSE)=0,\"\",VLOOKUP($T$2&\" Visitors\",SCHEDULE_TABLE,B$1,FALSE))","v":"ARI"},"PIT","JAX","GB","TB","CIN","MIN","HOU","OAK","MIA","WAS","DEN","NYJ","SF","DAL","NO",null,"pts"]
[null,"at","at","at","at","at","at","at","at","at","at","at","at","at","at","at","at"]
["HOME",{"$f":"IF(VLOOKUP($T$2&\" Homes\",SCHEDULE_TABLE,B$1,FALSE)=0,\"\",VLOOKUP($T$2&\" Homes\",SCHEDULE_TABLE,B$1,FALSE))","v":"STL"},"ATL","BAL","BUF","CAR","CLE","DET","IND","KC","NE","NYG","SD","TEN","SEA","PHI","CHI",null,"pts",null,null,null,null,"TOTAL POINTS FOR YEAR"]
["WINNER",null,null,null,null,null,null,null,null,null,null,null,null,null,null,null,null,{"$f":"IF(R3+R5=0,\"\",R3+R5)","v":""},"pts"]
{"$rows_left_out":105}
{"sheet":"Week 16","index":15,"n_rows":110,"n_cols":41,"rows_kept":110,"cut":false,"hidden":false,"merged":[[1,17,1,18],[1,19,3,23],[4,23,9,23],[9,17,9,18]]}
["Week Lookup Column Offset",2,3,4,5,6,7,8,9,10,11,12,13,14,15,16,17,null,null,null,null,null,null,{"$f":"MID(T2,FIND(\" \",T2)+1,2)*1+18","v":34}]
[null,"GAME 1","GAME 2","GAME 3","GAME 4","GAME 5","GAME 6","GAME 7","GAME 8","GAME 9","GAME 10","GAME 11","GAME 12","GAME 13","GAME 14","GAME 15","GAME 16","SCORE",null,"Week 16"]
["VISITOR",{"$f":"IF(VLOOKUP($T$2&\" Visitors\",SCHEDULE_TABLE,B$1,FALSE)=0,\"\",VLOOKUP($T$2&\" Visitors\",SCHEDULE_TABLE,B$1,FALSE))","v":"TEN"},"SD","PHI","CLE","DET","BAL","MIN","ATL","NE","KC","GB","NYG","IND","BUF","SEA","DEN",null,"pts"]
[null,"at","at","at","at","at","at","at","at","at","at","at","at","at","at","at","at"]
["HOME",{"$f":"IF(VLOOKUP($T$2&\" Homes\",SCHEDULE_TABLE,B$1,FALSE)=0,\"\",VLOOKUP($T$2&\" Homes\",SCHEDULE_TABLE,B$1,FALSE))","v":"JAX"},"SF","WAS","CAR","CHI","HOU","MIA","NO","NYJ","PIT","TB","STL","DAL","OAK","ARI","CIN",null,"pts",null,null,null,null,"TOTAL POINTS FOR YEAR"]
["WINNER",null,null,null,null,null,null,null,null,null,null,null,null,null,null,null,null,{"$f":"IF(R3+R5=0,\"\",R3+R5)","v":""},"pts"]
{"$rows_left_out":105}
{"sheet":"Week 17","index":16,"n_rows":110,"n_cols":41,"rows_kept":110,"cut":false,"hidden":false,"merged":[[1,17,1,18],[1,19,3,23],[4,23,9,23],[9,17,9,18]]}
["Week Lookup Column Offset",2,3,4,5,6,7,8,9,10,11,12,13,14,15,16,17,null,null,null,null,null,null,{"$f":"MID(T2,FIND(\" \",T2)+1,2)*1+18","v":35}]
[null,"GAME 1","GAME 2","GAME 3","GAME 4","GAME 5","GAME 6","GAME 7","GAME 8","GAME 9","GAME 10","GAME 11","GAME 12","GAME 13","GAME 14","GAME 15","GAME 16","SCORE",null,"Week 17"]
["VISITOR",{"$f":"IF(VLOOKUP($T$2&\" Visitors\",SCHEDULE_TABLE,B$1,FALSE)=0,\"\",VLOOKUP($T$2&\" Visitors\",SCHEDULE_TABLE,B$1,FALSE))","v":"CAR"},"CLE","DET","JAX","SD","NYJ","CHI","BUF","PHI","CIN","NO","IND","DAL","OAK","ARI","STL",null,"pts"]
[null,"at","at","at","at","at","at","at","at","at","at","at","at","at","at","at","at"]
["HOME",{"$f":"IF(VLOOKUP($T$2&\" Homes\",SCHEDULE_TABLE,B$1,FALSE)=0,\"\",VLOOKUP($T$2&\" Homes\",SCHEDULE_TABLE,B$1,FALSE))","v":"ATL"},"BAL","GB","HOU","KC","MIA","MIN","NE","NYG","PIT","TB","TEN","WAS","DEN","SF","SEA",null,"pts",null,null,null,null,"TOTAL POINTS FOR YEAR"]
["WINNER",null,null,null,null,null,null,null,null,null,null,null,null,null,null,null,null,{"$f":"IF(R3+R5=0,\"\",R3+R5)","v":""},"pts"]
{"$rows_left_out":105}
{"sheet":"cumulative_points","index":17,"n_rows":103,"n_cols":36,"rows_kept":103,"cut":false,"hidden":true,"merged":[[1,2,1,18],[1,19,1,35]]}
[]
[null,null,"Weekly Totals",null,null,null,null,null,null,null,null,null,null,null,null,null,null,null,null,"Cumulative Totals as of Each Week"]
[null,"PARTICIPANT","Week 1","Week 2","Week 3","Week 4","Week 5","Week 6","Week 7","Week 8","Week 9","Week 10","Week 11","Week 12","Week 13","Week 14","Week 15","Week 16","Week 17",{"$f":"C3","v":"Week 1"},{"$f":"D3","v":"Week 2"},"Week 3","Week 4","Week 5","Week 6","Week 7","Week 8","Week 9","Week 10","Week 11","Week 12","Week 13","Week 14","Week 15","Week 16","Week 17"]
[null,{"$f":"'Week 1'!A11","v":"<Enter Participant 1>"},{"$f":"IF(VLOOKUP($B4,INDIRECT(\"'\"&C$3&\"'!$A$10:$T$110\"),20,FALSE)=\"\",0,VLOOKUP($B4,INDIRECT(\"'\"&C$3&\"'!$A$10:$T$110\"),20,FALSE))","v":0},{"$f":"IF(VLOOKUP($B4,INDIRECT(\"'\"&D$3&\"'!$A$10:$T$110\"),20,FALSE)=\"\",0,VLOOKUP($B4,INDIRECT(\"'\"&D$3&\"'!$A$10:$T$110\"),20,FALSE))","v":0},0,0,0,0,0,0,0,0,0,0,0,0,0,0,0,{"$f":"SUM($C4:C4)","v":0},{"$f":"SUM($C4:D4)","v":0},{"$f":"SUM($C4:E4)","v":0},{"$f":"SUM($C4:F4)","v":0},{"$f":"SUM($C4:G4)","v":0},{"$f":"SUM($C4:H4)","v":0},{"$f":"SUM($C4:I4)","v":0},{"$f":"SUM($C4:J4)","v":0},{"$f":"SUM($C4:K4)","v":0},{"$f":"SUM($C4:L4)","v":0},{"$f":"SUM($C4:M4)","v":0},{"$f":"SUM($C4:N4)","v":0},{"$f":"SUM($C4:O4)","v":0},{"$f":"SUM($C4:P4)","v":0},{"$f":"SUM($C4:Q4)","v":0},{"$f":"SUM($C4:R4)","v":0},{"$f":"SUM($C4:S4)","v":0}]
[null,{"$f":"'Week 1'!A12","v":"<Enter Participant 2>"},{"$f":"IF(VLOOKUP($B5,INDIRECT(\"'\"&C$3&\"'!$A$10:$T$110\"),20,FALSE)=\"\",0,VLOOKUP($B5,INDIRECT(\"'\"&C$3&\"'!$A$10:$T$110\"),20,FALSE))","v":0},0,0,0,0,0,0,0,0,0,0,0,0,0,0,0,0,{"$f":"SUM($C5:C5)","v":0},{"$f":"SUM($C5:D5)","v":0},{"$f":"SUM($C5:E5)","v":0},{"$f":"SUM($C5:F5)","v":0},{"$f":"SUM($C5:G5)","v":0},{"$f":"SUM($C5:H5)","v":0},{"$f":"SUM($C5:I5)","v":0},{"$f":"SUM($C5:J5)","v":0},{"$f":"SUM($C5:K5)","v":0},{"$f":"SUM($C5:L5)","v":0},{"$f":"SUM($C5:M5)","v":0},{"$f":"SUM($C5:N5)","v":0},{"$f":"SUM($C5:O5)","v":0},{"$f":"SUM($C5:P5)","v":0},{"$f":"SUM($C5:Q5)","v":0},{"$f":"SUM($C5:R5)","v":0},{"$f":"SUM($C5:S5)","v":0}]
[null,{"$f":"'Week 1'!A13","v":"<Enter Participant 3>"},0,0,0,0,0,0,0,0,0,0,0,0,0,0,0,0,0,{"$f":"SUM($C6:C6)","v":0},{"$f":"SUM($C6:D6)","v":0},{"$f":"SUM($C6:E6)","v":0},{"$f":"SUM($C6:F6)","v":0},{"$f":"SUM($C6:G6)","v":0},{"$f":"SUM($C6:H6)","v":0},{"$f":"SUM($C6:I6)","v":0},{"$f":"SUM($C6:J6)","v":0},{"$f":"SUM($C6:K6)","v":0},{"$f":"SUM($C6:L6)","v":0},{"$f":"SUM($C6:M6)","v":0},{"$f":"SUM($C6:N6)","v":0},{"$f":"SUM($C6:O6)","v":0},{"$f":"SUM($C6:P6)","v":0},{"$f":"SUM($C6:Q6)","v":0},{"$f":"SUM($C6:R6)","v":0},{"$f":"SUM($C6:S6)","v":0}]
{"$rows_left_out":98}
{"sheet":"dev_notes","index":18,"n_rows":73,"n_cols":5,"rows_kept":73,"cut":false,"hidden":true,"merged":[]}
[]
[null,"2014-2015 Enhancements"]
[]
[null,"make it so I can easily copy-paste whole lists/tables of picks"]
[null,"allow me to delete whole ranges of picks"]
[null,"conditional color formatting of the teams would be cool"]
{"$rows_left_out":68}
{"sheet":"Schedule","index":19,"n_rows":68,"n_cols":18,"rows_kept":68,"cut":false,"hidden":true,"merged":[]}
[]
["Week 1",{"$f":"A2&\" Visitors\"","v":"Week 1 Visitors"},"GB","NO","CIN","BUF","WAS","TEN","NE","OAK","JAX","CLE","MIN","SF","CAR","IND","NYG","SD"]
[null,null,"at","at","at","at","at","at","at","at","at","at","at","at","at","at","at","at"]
[null,{"$f":"A2&\" Homes\"","v":"Week 1 Homes"},"SEA","ATL","BAL","CHI","HOU","KC","MIA","NYJ","PHI","PIT","STL","DAL","TB","DEN","DET","ARI"]
[]
["Week 2",{"$f":"A6&\" Visitors\"","v":"Week 2 Visitors"},"PIT","MIA","DET","ATL","NO","NE","ARI","DAL","JAX","SEA","STL","KC","NYJ","HOU","CHI","PHI"]
{"$rows_left_out":62}